{"text_format":"1","workbook":"xlsx","n_sheets":14,"sheets":["VERA Pension Factors","VERA LS Factors","PI Data","Contents","Guidance Notes","Member Details","Age","PI Finder","Benefit Certificate","Letter","Practitioners Member Details","Practitioners Letter","Practitioners PI Finder","Practitioners Ben Certificate"],"not_rendered":{"charts":0,"images":5,"macros":1,"external_links":1,"defined_names":14,"comments":0,"pivot_tables":0},"unopened":[],"bounds":{"document_bytes":16777216,"sheet_cells":100000,"rows_first":2000,"rows_last":500,"rows_between":2000,"halvings":0,"cell_chars":16384,"cell_head_chars":4096},"cells_cut":0,"cells_raw":0,"read":"whole","date_system":"1900"}

{"sheet":"VERA Pension Factors","index":0,"n_rows":59,"n_cols":28,"rows_kept":59,"cut":false,"hidden":true,"merged":[[7,0,7,12],[36,0,36,12],[7,15,7,27],[36,15,36,27]]}
[1995]
["TABLE ERF1","Updated 29/01/2019",null,null,null,null,null,null,null,null,null,null,null,null,null,"TABLE ERF1",null,"Updated 13/07/2023"]
["NHS SUPERANNUATION SCHEME SCOTLAND: ACTUARIAL FACTORS",null,null,null,null,null,null,null,null,null,null,null,null,null,null,"NHS SUPERANNUATION SCHEME SCOTLAND: ACTUARIAL FACTORS"]
["BENEFITS PAYABLE TO THE MEMBER ON VOLUNTARY EARLY RETIREMENT (WITH ACTUARIAL REDUCTION)",null,null,null,null,null,null,null,null,null,null,null,null,null,null,"BENEFITS PAYABLE TO THE MEMBER ON VOLUNTARY EARLY RETIREMENT (WITH ACTUARIAL REDUCTION)"]
["MEMBERS OF 1995 SECTION (RELATIVE TO PENSION AGE OF 60)",null,null,null,null,null,null,null,null,null,null,null,null,null,null,"MEMBERS OF 1995 SECTION (RELATIVE TO PENSION AGE OF 60)"]
[]
["Age: complete months",0,1,2,3,4,5,6,7,8,9,10,11,null,null,"Age: complete months",0,1,2,3,4,5,6,7,8,9,10,11]
["PENSION FACTORS",null,null,null,null,null,null,null,null,null,null,null,null,null,null,"PENSION FACTORS"]
[50,0.65400000000000003,0.65600000000000003,0.65800000000000003,0.66,0.66200000000000003,0.66400000000000003,0.66600000000000004,0.66800000000000004,0.67,0.67200000000000004,0.67400000000000004,0.67700000000000005,null,null,50,0.67600000000000005,0.67800000000000005,0.68,0.68200000000000005,0.68400000000000005,0.68600000000000005,0.68799999999999994,0.68899999999999995,0.69099999999999995,0.69299999999999995,0.69499999999999995,0.69699999999999995]
[51,0.67900000000000005,0.68100000000000005,0.68300000000000005,0.68500000000000005,0.68700000000000006,0.68899999999999995,0.69199999999999995,0.69399999999999995,0.69599999999999995,0.69799999999999995,0.7,0.70199999999999996,null,null,51,0.69899999999999995,0.70099999999999996,0.70299999999999996,0.70499999999999996,0.70699999999999996,0.70899999999999996,0.71099999999999997,0.71299999999999997,0.71499999999999997,0.71699999999999997,0.71899999999999997,0.72099999999999997]
[52,0.70499999999999996,0.70699999999999996,0.70899999999999996,0.71199999999999997,0.71399999999999997,0.71599999999999997,0.71899999999999997,0.72099999999999997,0.72299999999999998,0.72599999999999998,0.72799999999999998,0.73,null,null,52,0.72299999999999998,0.72499999999999998,0.72799999999999998,0.73,0.73199999999999998,0.73399999999999999,0.73599999999999999,0.73899999999999999,0.74099999999999999,0.74299999999999999,0.745,0.747]
[53,0.73299999999999998,0.73499999999999999,0.73799999999999999,0.74,0.74299999999999999,0.745,0.748,0.75,0.753,0.755,0.75800000000000001,0.76,null,null,53,0.749,0.752,0.754,0.75700000000000001,0.75900000000000001,0.76100000000000001,0.76400000000000001,0.76600000000000001,0.76800000000000002,0.77100000000000002,0.77300000000000002,0.77500000000000002]
[54,0.76300000000000001,0.76600000000000001,0.76800000000000002,0.77100000000000002,0.77400000000000002,0.77700000000000002,0.77900000000000003,0.78200000000000003,0.78500000000000003,0.78800000000000003,0.79,0.79300000000000004,null,null,54,0.77800000000000002,0.78,0.78300000000000003,0.78600000000000003,0.78800000000000003,0.79100000000000004,0.79300000000000004,0.79600000000000004,0.79800000000000004,0.80100000000000005,0.80300000000000005,0.80600000000000005]
[55,0.79600000000000004,0.79900000000000004,0.80200000000000005,0.80500000000000005,0.80800000000000005,0.81100000000000005,0.81399999999999995,0.81699999999999995,0.82,0.82199999999999995,0.82499999999999996,0.82799999999999996,null,null,55,0.80900000000000005,0.81100000000000005,0.81399999999999995,0.81699999999999995,0.82,0.82199999999999995,0.82499999999999996,0.82799999999999996,0.83099999999999996,0.83399999999999996,0.83599999999999997,0.83899999999999997]
[56,0.83099999999999996,0.83499999999999996,0.83799999999999997,0.84099999999999997,0.84399999999999997,0.84699999999999998,0.85,0.85399999999999998,0.85699999999999998,0.86,0.86299999999999999,0.86599999999999999,null,null,56,0.84199999999999997,0.84499999999999997,0.84799999999999998,0.85099999999999998,0.85399999999999998,0.85699999999999998,0.86,0.86299999999999999,0.86599999999999999,0.86899999999999999,0.871,0.874]
[57,0.86899999999999999,0.873,0.876,0.879,0.88300000000000001,0.88600000000000001,0.89,0.89300000000000002,0.89600000000000002,0.9,0.90300000000000002,0.90700000000000003,null,null,57,0.877,0.88100000000000001,0.88400000000000001,0.88700000000000001,0.89,0.89300000000000002,0.89600000000000002,0.9,0.90300000000000002,0.90600000000000003,0.90900000000000003,0.91200000000000003]
[58,0.91,0.91400000000000003,0.91700000000000004,0.92100000000000004,0.92400000000000004,0.92800000000000005,0.93200000000000005,0.93500000000000005,0.93899999999999995,0.94299999999999995,0.94599999999999995,0.95,null,null,58,0.91500000000000004,0.91900000000000004,0.92200000000000004,0.92600000000000005,0.92900000000000005,0.93200000000000005,0.93600000000000005,0.93899999999999995,0.94299999999999995,0.94599999999999995,0.94899999999999995,0.95299999999999996]
[59,0.95299999999999996,0.95699999999999996,0.96099999999999997,0.96499999999999997,0.96899999999999997,0.97299999999999998,0.97699999999999998,0.98099999999999998,0.98499999999999999,0.98899999999999999,0.99299999999999999,0.996,null,null,59,0.95599999999999996,0.96,0.96399999999999997,0.96699999999999997,0.97099999999999997,0.97499999999999998,0.97799999999999998,0.98199999999999998,0.98499999999999999,0.98899999999999999,0.99299999999999999,0.996]
[]
["Notes: ","(1) these factors are applicable to use to calculate the actuarial reduction on voluntary early retirement for 1995 section members’ main scheme benefits, 1995 section members’ NPA 60 Added Years’ benefits and 1995 section members’ NPA 60 Additional Pension benefits (contracts exercised from 1 April 2011 onwards) (subject to note 5) "]
[null,"(2) benefits to be awarded are obtained by multiplying the accrued benefits (see note 3 below for Added Years’ benefits) by the relevant factor"]
[null,"(3) amount of Added Years’ benefit must first be multiplied by an appropriate proportion. This is calculated as 'period for which contributions were paid divided by period for which contributions should have been paid' "]
[null,"(4) reduced benefits to be calculated before any lump sum commutation option is exercised"]
[null,"(5) factors NOT to be used for former members with preserved benefits retiring early below age 55 – see Table ERF3"]
[]
[]
[]
[]
[]
[2008]
["TABLE ERF2","Updated 29/01/2019",null,null,null,null,null,null,null,null,null,null,null,null,null,"TABLE ERF2",null,"Updated 13/07/2023"]
["NHS SUPERANNUATION SCHEME SCOTLAND: ACTUARIAL FACTORS",null,null,null,null,null,null,null,null,null,null,null,null,null,null,"NHS SUPERANNUATION SCHEME SCOTLAND: ACTUARIAL FACTORS"]
["BENEFITS PAYABLE TO THE MEMBER ON VOLUNTARY EARLY RETIREMENT (WITH ACTUARIAL REDUCTION)",null,null,null,null,null,null,null,null,null,null,null,null,null,null,"BENEFITS PAYABLE TO THE MEMBER ON VOLUNTARY EARLY RETIREMENT (WITH ACTUARIAL REDUCTION)"]
["MEMBERS OF 1995 or 2008 SECTION (RELATIVE TO PENSION AGE OF 65)",null,null,null,null,null,null,null,null,null,null,null,null,null,null,"MEMBERS OF 1995 or 2008 SECTION (RELATIVE TO PENSION AGE OF 65)"]
[]
["Age: complete months",0,1,2,3,4,5,6,7,8,9,10,11,null,null,"Age: complete months",0,1,2,3,4,5,6,7,8,9,10,11]
["PENSION FACTORS",null,null,null,null,null,null,null,null,null,null,null,null,null,null,"PENSION FACTORS"]
["Complete Years",null,null,null,null,null,null,null,null,null,null,null,null,null,null,"Complete Years"]
[50,0.51,0.51100000000000001,0.51300000000000001,0.51500000000000001,0.51600000000000001,0.51800000000000002,0.51900000000000002,0.52100000000000002,0.52200000000000002,0.52400000000000002,0.52500000000000002,0.52700000000000002,null,null,50,0.53400000000000003,0.53500000000000003,0.53700000000000003,0.53800000000000003,0.54,0.54100000000000004,0.54300000000000004,0.54400000000000004,0.54600000000000004,0.54700000000000004,0.54800000000000004,0.55000000000000004]
[51,0.52800000000000002,0.53,0.53200000000000003,0.53300000000000003,0.53500000000000003,0.53700000000000003,0.53800000000000003,0.54,0.54200000000000004,0.54300000000000004,0.54500000000000004,0.54700000000000004,null,null,51,0.55100000000000005,0.55300000000000005,0.55500000000000005,0.55600000000000005,0.55800000000000005,0.55900000000000005,0.56100000000000005,0.56200000000000006,0.56399999999999995,0.56599999999999995,0.56699999999999995,0.56899999999999995]
[52,0.54800000000000004,0.55000000000000004,0.55200000000000005,0.55400000000000005,0.55600000000000005,0.55700000000000005,0.55900000000000005,0.56100000000000005,0.56299999999999994,0.56399999999999995,0.56599999999999995,0.56799999999999995,null,null,52,0.56999999999999995,0.57199999999999995,0.57399999999999995,0.57499999999999996,0.57699999999999996,0.57899999999999996,0.57999999999999996,0.58199999999999996,0.58399999999999996,0.58499999999999996,0.58699999999999997,0.58899999999999997]
[53,0.56999999999999995,0.57199999999999995,0.57399999999999995,0.57599999999999996,0.57799999999999996,0.57999999999999996,0.58099999999999996,0.58299999999999996,0.58499999999999996,0.58699999999999997,0.58899999999999997,0.59099999999999997,null,null,53,0.59099999999999997,0.59199999999999997,0.59399999999999997,0.59599999999999997,0.59799999999999998,0.6,0.60199999999999998,0.60299999999999998,0.60499999999999998,0.60699999999999998,0.60899999999999999,0.61099999999999999]
[54,0.59299999999999997,0.59499999999999997,0.59699999999999998,0.59899999999999998,0.60099999999999998,0.60399999999999998,0.60599999999999998,0.60799999999999998,0.61,0.61199999999999999,0.61399999999999999,0.61599999999999999,null,null,54,0.61299999999999999,0.61499999999999999,0.61699999999999999,0.61899999999999999,0.62,0.622,0.624,0.626,0.628,0.63,0.63200000000000001,0.63400000000000001]
[55,0.61799999999999999,0.62,0.623,0.625,0.627,0.63,0.63200000000000001,0.63400000000000001,0.63600000000000001,0.63900000000000001,0.64100000000000001,0.64300000000000002,null,null,55,0.63600000000000001,0.63900000000000001,0.64100000000000001,0.64300000000000002,0.64500000000000002,0.64700000000000002,0.64900000000000002,0.65200000000000002,0.65400000000000003,0.65600000000000003,0.65800000000000003,0.66]
[56,0.64600000000000002,0.64800000000000002,0.65,0.65300000000000002,0.65500000000000003,0.65800000000000003,0.66,0.66300000000000003,0.66500000000000004,0.66800000000000004,0.67,0.67200000000000004,null,null,56,0.66200000000000003,0.66500000000000004,0.66700000000000004,0.66900000000000004,0.67200000000000004,0.67400000000000004,0.67600000000000005,0.67900000000000005,0.68100000000000005,0.68300000000000005,0.68500000000000005,0.68799999999999994]
[57,0.67500000000000004,0.67700000000000005,0.68,0.68300000000000005,0.68500000000000005,0.68799999999999994,0.69,0.69299999999999995,0.69599999999999995,0.69799999999999995,0.70099999999999996,0.70299999999999996,null,null,57,0.69,0.69299999999999995,0.69499999999999995,0.69699999999999995,0.7,0.70199999999999996,0.70499999999999996,0.70699999999999996,0.71,0.71199999999999997,0.71499999999999997,0.71699999999999997]
[58,0.70599999999999996,0.70899999999999996,0.71199999999999997,0.71399999999999997,0.71699999999999997,0.72,0.72299999999999998,0.72599999999999998,0.72799999999999998,0.73099999999999998,0.73399999999999999,0.73699999999999999,null,null,58,0.72,0.72199999999999998,0.72499999999999998,0.72799999999999998,0.73,0.73299999999999998,0.73599999999999999,0.73799999999999999,0.74099999999999999,0.74399999999999999,0.746,0.749]
[59,0.74,0.74299999999999999,0.746,0.749,0.752,0.755,0.75800000000000001,0.76100000000000001,0.76400000000000001,0.76600000000000001,0.76900000000000002,0.77200000000000002,null,null,59,0.752,0.754,0.75700000000000001,0.76,0.76300000000000001,0.76600000000000001,0.76900000000000002,0.77100000000000002,0.77400000000000002,0.77700000000000002,0.78,0.78300000000000003]
[60,0.77500000000000002,0.77900000000000003,0.78200000000000003,0.78500000000000003,0.78800000000000003,0.79200000000000004,0.79500000000000004,0.79800000000000004,0.80100000000000005,0.80400000000000005,0.80800000000000005,0.81100000000000005,null,null,60,0.78600000000000003,0.78900000000000003,0.79200000000000004,0.79500000000000004,0.79800000000000004,0.80100000000000005,0.80400000000000005,0.80700000000000005,0.81,0.81299999999999994,0.81599999999999995,0.81899999999999995]
[61,0.81399999999999995,0.81799999999999995,0.82099999999999995,0.82499999999999996,0.82799999999999996,0.83099999999999996,0.83499999999999996,0.83799999999999997,0.84199999999999997,0.84499999999999997,0.84899999999999998,0.85199999999999998,null,null,61,0.82199999999999995,0.82599999999999996,0.82899999999999996,0.83199999999999996,0.83599999999999997,0.83899999999999997,0.84199999999999997,0.84599999999999997,0.84899999999999998,0.85199999999999998,0.85599999999999998,0.85899999999999999]
[62,0.85599999999999998,0.86,0.86299999999999999,0.86699999999999999,0.871,0.875,0.878,0.88200000000000001,0.88600000000000001,0.89,0.89300000000000002,0.89700000000000002,null,null,62,0.86199999999999999,0.86599999999999999,0.86899999999999999,0.873,0.877,0.88,0.88400000000000001,0.88700000000000001,0.89100000000000001,0.89500000000000002,0.89800000000000002,0.90200000000000002]
[63,0.90100000000000002,0.90500000000000003,0.90900000000000003,0.91300000000000003,0.91700000000000004,0.92100000000000004,0.92600000000000005,0.93,0.93400000000000005,0.93799999999999994,0.94199999999999995,0.94599999999999995,null,null,63,0.90500000000000003,0.90900000000000003,0.91300000000000003,0.91700000000000004,0.92100000000000004,0.92500000000000004,0.92900000000000005,0.93300000000000005,0.93700000000000006,0.94099999999999995,0.94499999999999995,0.94799999999999995]
[64,0.95,0.95399999999999996,0.95799999999999996,0.96299999999999997,0.96699999999999997,0.97099999999999997,0.97499999999999998,0.97899999999999998,0.98299999999999998,0.98799999999999999,0.99199999999999999,0.996,null,null,64,0.95199999999999996,0.95599999999999996,0.96,0.96399999999999997,0.96799999999999997,0.97199999999999998,0.97599999999999998,0.98,0.98399999999999999,0.98799999999999999,0.99199999999999999,0.996]
[]
["Notes: ","(1) these factors are applicable to use for 2008 section members’ main scheme benefits, 1995 section members’ NPA 65 Added Years’ pension or 1995 or 2008 section members’ NPA 65 Additional Pension (contracts taken from 1 April 2011 onwards).  See also paragraph 1.6 of the guidance."]
[null,"(2) benefits to be awarded are obtained by multiplying the accrued benefits (for Added Years’ pension see note 3) by the relevant factor"]
[null,"(3) amount of Added Years’ benefit must first be multiplied by an appropriate proportion. This is calculated as 'period for which contributions were paid divided by period for which contributions should have been paid' "]
[null,"(4) reduced benefits to be calculated before any lump sum commutation option is exercised"]
[null,"(5) shaded figures to be used for 1995 section members only"]

{"sheet":"VERA LS Factors","index":1,"n_rows":24,"n_cols":28,"rows_kept":24,"cut":false,"hidden":true,"merged":[[7,0,7,12],[7,15,7,27]]}
[]
["TABLE ERF7","Updated 29/01/2019",null,null,null,null,null,null,null,null,null,null,null,null,null,"TABLE ERF7",null,"Updated 13/07/2023"]
["NHS SUPERANNUATION SCHEME SCOTLAND: ACTUARIAL FACTORS",null,null,null,null,null,null,null,null,null,null,null,null,null,null,"NHS SUPERANNUATION SCHEME SCOTLAND: ACTUARIAL FACTORS"]
["BENEFITS PAYABLE TO THE MEMBER ON VOLUNTARY EARLY RETIREMENT (WITH ACTUARIAL REDUCTION)",null,null,null,null,null,null,null,null,null,null,null,null,null,null,"BENEFITS PAYABLE TO THE MEMBER ON VOLUNTARY EARLY RETIREMENT (WITH ACTUARIAL REDUCTION)"]
["MEMBERS OF 1995 SECTION (RELATIVE TO PENSION AGE OF 60)",null,null,null,null,null,null,null,null,null,null,null,null,null,null,"MEMBERS OF 1995 SECTION (RELATIVE TO PENSION AGE OF 60)"]
[]
["AGE: complete months",0,1,2,3,4,5,6,7,8,9,10,11,null,null,"AGE: complete months",0,1,2,3,4,5,6,7,8,9,10,11]
["LUMP SUM FACTORS",null,null,null,null,null,null,null,null,null,null,null,null,null,null,"LUMP SUM FACTORS"]
["Complete Years:",null,null,null,null,null,null,null,null,null,null,null,null,null,null,"Complete Years:"]
[50,0.78900000000000003,0.79,0.79200000000000004,0.79400000000000004,0.79500000000000004,0.79700000000000004,0.79800000000000004,0.8,0.80100000000000005,0.80300000000000005,0.80500000000000005,0.80600000000000005,null,null,50,0.84499999999999997,0.84599999999999997,0.84699999999999998,0.84799999999999998,0.85,0.85099999999999998,0.85199999999999998,0.85299999999999998,0.85399999999999998,0.85599999999999998,0.85699999999999998,0.85799999999999998]
[51,0.80800000000000005,0.80900000000000005,0.81100000000000005,0.81299999999999994,0.81399999999999995,0.81599999999999995,0.81699999999999995,0.81899999999999995,0.82099999999999995,0.82199999999999995,0.82399999999999995,0.82599999999999996,null,null,51,0.85899999999999999,0.86,0.86199999999999999,0.86299999999999999,0.86399999999999999,0.86499999999999999,0.86699999999999999,0.86799999999999999,0.86899999999999999,0.87,0.871,0.873]
[52,0.82699999999999996,0.82899999999999996,0.83,0.83199999999999996,0.83399999999999996,0.83499999999999996,0.83699999999999997,0.83899999999999997,0.84,0.84199999999999997,0.84399999999999997,0.84499999999999997,null,null,52,0.874,0.875,0.876,0.878,0.879,0.88,0.88100000000000001,0.88300000000000001,0.88400000000000001,0.88500000000000001,0.88600000000000001,0.88700000000000001]
[53,0.84699999999999998,0.84899999999999998,0.85,0.85199999999999998,0.85399999999999998,0.85599999999999998,0.85699999999999998,0.85899999999999999,0.86099999999999999,0.86199999999999999,0.86399999999999999,0.86599999999999999,null,null,53,0.88900000000000001,0.89,0.89100000000000001,0.89200000000000002,0.89400000000000002,0.89500000000000002,0.89600000000000002,0.89800000000000002,0.89900000000000002,0.9,0.90100000000000002,0.90300000000000002]
[54,0.86699999999999999,0.86899999999999999,0.871,0.873,0.874,0.876,0.878,0.88,0.88100000000000001,0.88300000000000001,0.88500000000000001,0.88600000000000001,null,null,54,0.90400000000000003,0.90500000000000003,0.90600000000000003,0.90800000000000003,0.90900000000000003,0.91,0.91100000000000003,0.91300000000000003,0.91400000000000003,0.91500000000000004,0.91700000000000004,0.91800000000000004]
[55,0.88800000000000001,0.89,0.89200000000000002,0.89400000000000002,0.89500000000000002,0.89700000000000002,0.89900000000000002,0.90100000000000002,0.90200000000000002,0.90400000000000003,0.90600000000000003,0.90800000000000003,null,null,55,0.91900000000000004,0.92,0.92200000000000004,0.92300000000000004,0.92400000000000004,0.92600000000000005,0.92700000000000005,0.92800000000000005,0.93,0.93100000000000005,0.93200000000000005,0.93300000000000005]
[56,0.90900000000000003,0.91100000000000003,0.91300000000000003,0.91500000000000004,0.91700000000000004,0.91900000000000004,0.92,0.92200000000000004,0.92400000000000004,0.92600000000000005,0.92800000000000005,0.93,null,null,56,0.93500000000000005,0.93600000000000005,0.93700000000000006,0.93899999999999995,0.94,0.94099999999999995,0.94299999999999995,0.94399999999999995,0.94499999999999995,0.94699999999999995,0.94799999999999995,0.94899999999999995]
[57,0.93100000000000005,0.93300000000000005,0.93500000000000005,0.93700000000000006,0.93899999999999995,0.94099999999999995,0.94199999999999995,0.94399999999999995,0.94599999999999995,0.94799999999999995,0.95,0.95199999999999996,null,null,57,0.95099999999999996,0.95199999999999996,0.95299999999999996,0.95499999999999996,0.95599999999999996,0.95699999999999996,0.95899999999999996,0.96,0.96099999999999997,0.96299999999999997,0.96399999999999997,0.96599999999999997]
[58,0.95399999999999996,0.95599999999999996,0.95699999999999996,0.95899999999999996,0.96099999999999997,0.96299999999999997,0.96499999999999997,0.96699999999999997,0.96899999999999997,0.97099999999999997,0.97299999999999998,0.97499999999999998,null,null,58,0.96699999999999997,0.96799999999999997,0.97,0.97099999999999997,0.97199999999999998,0.97399999999999998,0.97499999999999998,0.97599999999999998,0.97799999999999998,0.97899999999999998,0.98099999999999998,0.98199999999999998]
[59,0.97699999999999998,0.97899999999999998,0.98,0.98199999999999998,0.98399999999999999,0.98599999999999999,0.98799999999999999,0.99,0.99199999999999999,0.99399999999999999,0.996,0.998,null,null,59,0.98299999999999998,0.98499999999999999,0.98599999999999999,0.98699999999999999,0.98899999999999999,0.99,0.99199999999999999,0.99299999999999999,0.99399999999999999,0.996,0.997,0.999]
[]
["Notes: ","(1) these factors are applicable to use to calculate the actuarial reduction on voluntary early retirement for 1995 section members’ main scheme lump sum benefits, 1995 section members’  NPA 60 Added Years’ lump sum benefits , 1995 section members’  NPA 60 unreduced retirement lump sum benefits and the amount of 2008 section members’ mandatory lump sum  benefits payable on voluntary early retirement (where applicable) (subject to note 4)"]
[null,"(2) benefits to be awarded are obtained by multiplying the accrued lump sum (for Added Years’ lump sum and unreduced retirement lump sums see note 3) by the relevant factor"]
[null,"(3) the amount of the Added Years’ unreduced retirement lump sum or the unreduced retirement lump sum must first be multiplied by an appropriate proportion. This is calculated as 'period for which contributions were paid divided by period for which contributions should have been paid' "]
[null,"(4) factors are NOT to be used for former members with preserved benefits retiring early below age 55 – see Table ERF9"]

{"sheet":"PI Data","index":2,"n_rows":619,"n_cols":8,"rows_kept":619,"cut":false,"hidden":true,"merged":[]}
[{"$f":"MIN($B$2:$Z$2)","v":2020}]
[{"$f":"MAX($B$2:$Z$2)","v":2026},2020,2021,2022,2023,2024,2025,2026]
["1945-01-01",42.348300000000002,42.560099999999998,43.879399999999997,48.311199999999999,51.548099999999998,52.424399999999999,54.416499999999999]
["1946-01-01",38.4955,38.688000000000002,39.887300000000003,43.915900000000001,46.8583,47.654899999999998,49.465800000000002]
["1947-01-01",38.151200000000003,38.341999999999999,39.5306,43.523099999999999,46.4392,47.228700000000003,49.023299999999999]
["1948-01-01",35.724699999999999,35.903399999999998,37.016399999999997,40.755000000000003,43.485599999999998,44.224899999999998,45.9054]
["1949-01-01",34.741,34.914700000000003,35.997100000000003,39.632800000000003,42.288200000000003,43.007100000000001,44.641399999999997]
["1950-01-01",33.757300000000001,33.926099999999998,34.977800000000002,38.510599999999997,41.090800000000002,41.789299999999997,43.377299999999998]
["1951-01-01",30.920999999999999,31.075600000000001,32.038899999999998,35.274900000000002,37.638300000000001,38.278100000000002,39.732700000000001]
["1952-01-01",28.3306,28.472200000000001,29.354900000000001,32.319699999999997,34.485100000000003,35.071399999999997,36.4041]
["1953-01-01",27.461600000000001,27.599,28.454499999999999,31.328399999999998,33.427399999999999,33.995699999999999,35.287500000000001]
["1954-01-01",26.969799999999999,27.104600000000001,27.944900000000001,30.767299999999999,32.828699999999998,33.386800000000001,34.655500000000004]
["1955-01-01",25.805800000000001,25.934799999999999,26.738800000000001,29.439399999999999,31.411799999999999,31.945799999999998,33.159799999999997]
["1956-01-01",24.608899999999998,24.731999999999999,25.498699999999999,28.074000000000002,29.954999999999998,30.464200000000002,31.6218]
["1957-01-01",23.74,23.858699999999999,24.598299999999998,27.082699999999999,28.897300000000001,29.388500000000001,30.505299999999998]
["1958-01-01",23.018599999999999,23.133700000000001,23.8508,26.259799999999998,28.019200000000001,28.4955,29.578299999999999]
["1959-01-01",22.9038,23.0184,23.7319,26.128799999999998,27.8795,28.353400000000001,29.430900000000001]
["1960-01-01",22.674299999999999,22.787700000000001,23.4941,25.867000000000001,27.600100000000001,28.069299999999998,29.135899999999999]
["1961-01-01",21.936499999999999,22.046199999999999,22.729600000000001,25.025300000000001,26.702000000000002,27.155999999999999,28.187899999999999]
["1962-01-01",21.0184,21.1235,21.778300000000002,23.977900000000002,25.584499999999998,26.019400000000001,27.008099999999999]
["1963-01-01",20.6249,20.728100000000001,21.3706,23.5291,25.105499999999999,25.532299999999999,26.502500000000001]
["1964-01-01",19.969100000000001,20.068999999999999,20.691099999999999,22.780899999999999,24.307200000000002,24.720500000000001,25.659800000000001]
["1965-01-01",19.050999999999998,19.1463,19.739799999999999,21.733499999999999,23.189699999999998,23.5839,24.4801]
["1966-01-01",18.329599999999999,18.421299999999999,18.9923,20.910599999999999,22.311599999999999,22.690899999999999,23.553100000000001]
["1967-01-01",17.887,17.976400000000002,18.5337,20.4056,21.7727,22.142900000000001,22.984300000000001]
["1968-01-01",17.083600000000001,17.169,17.7013,19.489100000000001,20.794899999999998,21.148399999999999,21.952000000000002]
["1969-01-01",16.395,16.477,16.9878,18.703499999999998,19.956700000000001,20.2959,21.0672]
["1969-04-02",16.117100000000001,16.197700000000001,16.6998,18.386500000000002,19.618400000000001,19.951899999999998,20.710100000000001]
["1969-10-02",15.8393,15.9184,16.411899999999999,18.069500000000001,19.280200000000001,19.607900000000001,20.353000000000002]
["1970-04-02",15.2835,15.3599,15.8361,17.435500000000001,18.6037,18.919899999999998,19.6389]
["1970-10-02",14.7277,14.801399999999999,15.260199999999999,16.801500000000001,17.927199999999999,18.2319,18.924800000000001]
["1971-04-02",14.033099999999999,14.103300000000001,14.5405,16.0091,17.081700000000001,17.3721,18.0322]
["1971-10-02",13.3505,13.417199999999999,13.8331,15.2303,16.250699999999998,16.527000000000001,17.155000000000001]
["1972-04-02",13.085000000000001,13.150399999999999,13.558,14.9274,15.9275,16.1983,16.8139]
["1972-07-02",12.7697,12.833600000000001,13.231400000000001,14.5678,15.543799999999999,15.8081,16.408799999999999]
["1973-01-02",12.2723,12.3337,12.715999999999999,14.000400000000001,14.9384,15.192299999999999,15.7697]
["1973-07-02",11.7256,11.7843,12.1496,13.3767,14.2729,14.515499999999999,15.0671]
["1974-01-02",11.149800000000001,11.205500000000001,11.552899999999999,12.7197,13.571899999999999,13.8027,14.327199999999999]
["1974-07-02",10.1805,10.231400000000001,10.5486,11.614000000000001,12.392099999999999,12.6028,13.0817]
["1975-01-02",9.4404000000000003,9.4876000000000005,9.7817000000000007,10.7697,11.491199999999999,11.6866,12.130699999999999]
["1975-07-02",8.2471999999999994,8.2883999999999993,8.5452999999999992,9.4084000000000003,10.0388,10.2094,10.5974]
["1976-01-02",7.5276175348608003,7.5652556238592004,7.7997785476544008,8.5875561806016005,9.1629000000000005,9.318692126636801,9.6728000000000005]
["1976-07-02",7.0245756238729999,7.0596985032984998,7.2785491563495004,8.0136826207535012,8.5505999999999993,8.6959595457860015,9.0264000000000006]
["1977-01-02",6.5484328409996007,6.5811750064222005,6.7851914311074006,7.4704957652882014,7.9710000000000001,8.1065263046072005,8.4146000000000001]
["1977-07-02",5.9987181878376008,6.0287117798832002,6.2156018445552004,6.8433776305416005,7.3018999999999998,7.4260159589048014,7.7081999999999997]
["1978-01-02",5.7743135840954993,5.8031851530809995,5.983083892340999,6.5873753651655003,7.0286999999999997,7.1482179166464999,7.4199000000000002]
["1978-07-02",5.8177223804502001,5.8468109934042003,6.0280621337196001,6.6368964089772007,7.0815999999999999,7.201955132596801,7.4756]
["1978-07-28",5.7516655164386004,5.7804238450606,5.9596169837828006,6.5615382988996007,7.0011999999999999,7.1201811083824005,7.3906999999999998]
["1978-08-28",5.6808903049975994,5.7092947575495998,5.8862828945647996,6.4807974666736001,6.915,7.0325660824384002,7.2998000000000003]
["1978-09-28",5.6148334409859997,5.6429076092059995,5.8178377446279992,6.4054393565960002,6.8346,6.9507920582239997,7.2149000000000001]
["1978-10-28",5.5440582295450005,5.5717785216950011,5.7445036554100009,6.3246985243700014,6.7484999999999999,6.8631770322800021,7.1239999999999997]
["1978-11-28",5.4732830181039995,5.500649434184,5.6711695661919999,6.2439576921439999,6.6623000000000001,6.775562006336,7.0330000000000004]
["1978-12-28",5.4072261540923989,5.4342622858403997,5.6027244162551995,6.1685995820663999,6.5819000000000001,6.6937879821215995,6.9481999999999999]
["1979-01-28",5.3364509426513997,5.3631331983294004,5.5293903270372002,6.0878587498404002,6.4957000000000003,6.6061729561776001,6.8571999999999997]
["1979-02-28",5.2703940786397991,5.2967460499858001,5.4609451771003998,6.0125006397628002,6.4153000000000002,6.5243989319632005,6.7723000000000004]
["1979-03-28",5.1996188671988,5.2256169624748008,5.3876110878824006,5.9317598075368005,6.3292000000000002,6.4367839060192011,6.6814]
["1979-04-28",5.1335620031872002,5.1592298141312005,5.3191659379456002,5.8564016974592006,6.2488000000000001,6.3550098818048006,6.5964999999999998]
["1979-05-28",5.0627867917461993,5.0881007266201994,5.2458318487275992,5.7756608652332,6.1626000000000003,6.2673948558608004,6.5056000000000003]
["1979-06-28",4.9920115803052001,5.0169716391092001,5.1724977595096,5.6949200330072003,6.0765000000000002,6.179779829916801,6.4146000000000001]
["1979-07-28",4.9259547162935995,4.9505844907655998,5.1040526095728005,5.6195619229296003,5.9961000000000002,6.0980058057024005,6.3296999999999999]
["1979-08-28",4.8551795048525994,4.8794554032545996,5.0307185203547995,5.5388210907035997,5.9099000000000004,6.0103907797584002,6.2388000000000003]
["1979-09-28",4.7891226408409988,4.8130682549109993,4.9622733704179991,5.4634629806259998,5.8295000000000003,5.9286167555439997,6.1539000000000001]
["1979-10-28",4.7183474294160002,4.7419391674345004,4.8889392812425001,5.3827221483514993,5.7434000000000003,5.8410017295829997,6.0629999999999997]
["1979-12-09",4.6616462585903999,4.6849544907443006,4.8301880795795,5.3180370753240993,5.6742999999999997,5.7708094341202001,5.9901]
["1980-01-09",4.6089951713951995,4.6320401481033997,4.7756333923209997,5.2579723646557994,5.6102999999999996,5.7056308740475998,5.9223999999999997]
["1980-02-09",4.5522940005696002,4.5750554714132008,4.7168821906580005,5.1932872916284003,5.5411999999999999,5.6354385785848002,5.8495999999999997]
["1980-03-09",4.495592829744,4.518070794723001,4.6581309889950004,5.1286022186010003,5.4722,5.5652462831220006,5.7766999999999999]
["1980-04-09",4.4388916589183998,4.4610861180328012,4.5993797873320004,5.0639171455736003,5.4032,5.4950539876592002,5.7039]
["1980-05-09",4.3862405717231994,4.4081717753919003,4.5448251000735,5.0038524349052995,5.3391000000000002,5.4298754275865999,5.6361999999999997]
["1980-06-09",4.3295394008975991,4.3511870987017005,4.4860738984105,4.9391673618778995,5.2701000000000002,5.3596831321237994,5.5633999999999997]
["1980-07-09",4.2728382300719989,4.2942024220114998,4.4273226967474999,4.8744822888504995,5.2011000000000003,5.2894908366609998,5.4904999999999999]
["1980-08-09",4.2161370592463996,4.2372177453213,4.3685714950844998,4.8097972158230995,5.1321000000000003,5.2192985411981994,5.4176000000000002]
["1980-09-09",4.1634859720512001,4.1843034026804009,4.3140168078260004,4.7497325051547996,5.0679999999999996,5.1541199811256,5.35]
["1980-10-09",4.1067848012255999,4.1273187259902002,4.2552656061630003,4.6850474321273996,4.9988999999999999,5.0839276856628004,5.2770999999999999]
["1980-11-09",4.0500836303536003,4.0703340492905999,4.1965144044576199,4.6203623591140399,4.9298999999999999,5.0137353901611199,5.2042999999999999]
["1980-12-08",4.0222314139336,4.0423425717830996,4.16765519114987,4.58858836526354,4.8959999999999999,4.9792561902471197,5.1684999999999999]
["1981-01-08",3.9940078346279999,4.0139778745754997,4.1384111883313492,4.5563907181617003,4.8616999999999999,4.9443172676675999,5.1322000000000001]
["1981-02-08",3.9661556182080004,3.9859863970679998,4.1095519750236003,4.5246167243112003,4.8277999999999999,4.9098380677536007,5.0964]
["1981-03-08",3.9379320389024004,3.9576216998603999,4.0803079722050795,4.4924190772093606,4.7934000000000001,4.87489914517408,5.0601000000000003]
["1981-04-08",3.9100798224824,3.9296302223528996,4.0514487588973296,4.4606450833588598,4.7595000000000001,4.8404199452600798,5.0244]
["1981-05-08",3.8818562431767996,3.9012655251452997,4.0222047560788097,4.4284474362570201,4.7252000000000001,4.80548102268056,4.9881000000000002]
["1981-06-08",3.8540040267568005,3.8732740476378003,3.9933455427710602,4.3966734424065201,4.6913,4.7710018227665607,4.9523000000000001]
["1981-07-08",3.8257804474512001,3.8449093504301999,3.9641015399525399,4.3644757953046804,4.6569000000000003,4.73606290018704,4.9160000000000004]
["1981-08-08",3.7979282310312001,3.8169178729226996,3.9352423266447896,4.3327018014541796,4.6230000000000002,4.7015837002730398,4.8802000000000003]
["1981-09-08",3.7697046517255997,3.7885531757150996,3.9059983238262697,4.3005041543523399,4.5885999999999996,4.6666447776935192,4.8440000000000003]
["1981-10-08",3.7418524353056002,3.7605616982076002,3.8771391105185202,4.2687301605018408,4.5547000000000004,4.6321655777795199,4.8082000000000003]
["1981-11-08",3.7136288560200006,3.7321970009550003,3.8478951077010004,4.2365325133800003,4.5204000000000004,4.5972266551830003,4.7718999999999996]
["1981-12-07",3.6835183517819998,3.7019359441905002,3.8166959581790998,4.2021822497579997,4.4836999999999998,4.5599518444652993,4.7332000000000001]
["1982-01-07",3.6534078475440004,3.6716748874260006,3.7854968086572001,4.167831986136,4.4470999999999998,4.5226770337476001,4.6944999999999997]
["1982-02-07",3.6232973433060001,3.6414138306615,3.7542976591352999,4.1334817225139995,4.4104000000000001,4.4854022230299,4.6558000000000002]
["1982-03-07",3.5898412274860001,3.6077904342565001,3.7196319374442997,4.0953147629339997,4.3696999999999999,4.4439857666768994,4.6128999999999998]
["1982-04-07",3.5597307232480002,3.5775293774920005,3.6884327879224004,4.060964499312,4.3330000000000002,4.4067109559592001,4.5742000000000003]
["1982-05-07",3.5296202190099999,3.5472683207275,3.6572336384004998,4.0266142356899994,4.2964000000000002,4.3694361452414991,4.5354999999999999]
["1982-06-07",3.499509714772,3.5170072639630003,3.6260344888786,3.9922639720680002,4.2596999999999996,4.3321613345237999,4.4968000000000004]
["1982-07-07",3.4693992105339997,3.4867462071984998,3.5948353393566999,3.9579137084459997,4.2230999999999996,4.2948865238060998,4.4581]
["1982-08-07",3.4392887062960003,3.4564851504340002,3.5636361898348001,3.923563444824,4.1863999999999999,4.2576117130883997,4.4194000000000004]
["1982-09-07",3.4058325904760003,3.4228617540290003,3.5289704681437999,3.8853964852440002,4.1456999999999997,4.2161952567354,4.3764000000000003]
["1982-10-07",3.3757220862379995,3.3926006972644998,3.4977713186218997,3.8510462216219996,4.1090999999999998,4.178920446017699,4.3376999999999999]
["1982-11-07",3.3456115820489996,3.3623396404932997,3.4665721691329998,3.8166959579987001,4.0724,4.1416456353496995,4.2990000000000004]
["1982-12-06",3.335932860018,3.3526125248506,3.4565435129060003,3.8056544074934004,4.0606,4.1296640182753999,4.2866]
["1983-01-06",3.3262541379869996,3.3428854092078999,3.4465148566789998,3.7946128569880999,4.0488999999999997,4.1176824012010993,4.2742000000000004]
["1983-02-06",3.3165754159559997,3.3331582935652002,3.4364862004520003,3.7835713064828003,4.0370999999999997,4.1057007841267996,4.2617000000000003]
["1983-03-06",3.3068966939249997,3.3234311779224996,3.4264575442249998,3.7725297559774997,4.0252999999999997,4.0937191670524999,4.2492999999999999]
["1983-04-06",3.2972179718939998,3.3137040622798,3.4164288879979998,3.7614882054722001,4.0134999999999996,4.0817375499782003,4.2367999999999997]
["1983-05-06",3.2875392498629994,3.3039769466370998,3.4064002317709998,3.7504466549669,4.0016999999999996,4.0697559329038997,4.2244000000000002]
["1983-06-06",3.2746342871549996,3.2910074591134997,3.3930286901349995,3.7357245876264997,3.9860000000000002,4.0537804434714992,4.2077999999999998]
["1983-07-06",3.2649555651239996,3.2812803434708,3.383000033908,3.7246830371212001,3.9742000000000002,4.0417988263971996,4.1954000000000002]
["1983-08-06",3.2552768430929997,3.2715532278280994,3.3729713776809995,3.7136414866159,3.9624999999999999,4.0298172093228999,4.1829999999999998]
["1983-09-06",3.2455981210619997,3.2618261121853998,3.362942721454,3.7025999361106003,3.9506999999999999,4.0178355922486002,4.1704999999999997]
["1983-10-06",3.2359193990309993,3.2520989965426996,3.3529140652269995,3.6915583856052998,3.9388999999999998,4.0058539751742996,4.1581000000000001]
["1983-11-06",3.2262406770325001,3.2423718808511999,3.3428854090238995,3.6805168350526998,3.9270999999999998,3.9938723580918998,4.1456]
["1983-12-11",3.2139619304024998,3.2300317404863996,3.3301627243082996,3.6665091591818997,3.9121999999999999,3.9786720827042998,4.1299000000000001]
["1984-01-11",3.2016831837724999,3.2176916001215998,3.3174400395926997,3.6525014833110996,3.8972000000000002,3.9634718073166995,4.1140999999999996]
["1984-02-11",3.1863347504850004,3.2022664246655999,3.3015366836981999,3.6349918884726002,3.8784999999999998,3.9444714630822002,4.0944000000000003]
["1984-03-11",3.1740560038550001,3.1899262843008001,3.2888139989826,3.6209842126018001,3.8635999999999999,3.9292711876945998,4.0785999999999998]
["1984-04-11",3.1617772572250002,3.1775861439360003,3.2760913142670001,3.606976536731,3.8485999999999998,3.9140709123069999,4.0628000000000002]
["1984-05-11",3.1494985105950004,3.1652460035712,3.2633686295514002,3.5929688608602,3.8336999999999999,3.8988706369193999,4.0469999999999997]
["1984-06-11",3.1341500773074999,3.1498208281151996,3.2474652736568999,3.5754592660216997,3.8149999999999999,3.8798702926848994,4.0273000000000003]
["1984-07-11",3.1218713306774997,3.1374806877503998,3.2347425889412995,3.5614515901508996,3.8001,3.8646700172972994,4.0114999999999998]
["1984-08-11",3.1095925840474998,3.1251405473855995,3.2220199042256996,3.5474439142800995,3.7850999999999999,3.8494697419096995,3.9956999999999998]
["1984-09-11",3.0973138374175,3.1128004070207997,3.2092972195100997,3.5334362384092994,3.7702,3.8342694665220995,3.98]
["1984-10-11",3.08196540413,3.0973752315647998,3.1933938636155998,3.5159266435708001,3.7515000000000001,3.8152691222875998,3.9601999999999999]
["1984-11-11",3.0696866574500001,3.0850350911920001,3.180671178876,3.5019189676570002,3.7364999999999999,3.8000688469470001,3.9445000000000001]
["1984-12-10",3.05247346124,3.0677358289984005,3.1628356395551998,3.4822820388664,3.7155999999999998,3.7787600496743998,3.9224000000000001]
["1985-01-10",3.0352602650300002,3.0504365668048004,3.1450001002343999,3.4626451100757998,3.6945999999999999,3.7574512524018,3.9001999999999999]
["1985-02-10",3.0209159348549997,3.0360205149768,3.1301371508003997,3.4462810027502995,3.6772,3.7396939213412996,3.8818000000000001]
["1985-03-10",3.0037027386449999,3.0187212527831999,3.1123016114795994,3.4266440739596997,3.6562000000000001,3.7183851240686994,3.8597000000000001]
["1985-04-10",2.9864895424349998,3.0014219905895998,3.0944660721587995,3.4070071451690995,3.6353,3.6970763267960995,3.8376000000000001]
["1985-05-10",2.9692763462249996,2.9841227283959997,3.0766305328379997,3.3873702163784998,3.6143000000000001,3.6757675295234997,3.8153999999999999]
["1985-06-10",2.9520631500149999,2.9668234662024,3.0587949935171994,3.3677332875878996,3.5933999999999999,3.6544587322508995,3.7932999999999999]
["1985-07-10",2.9348499538049997,2.9495242040087999,3.0409594541963996,3.3480963587972994,3.5724,3.6331499349782996,3.7711999999999999]
["1985-08-10",2.92050562363,2.9351081521808,3.0260965047623998,3.3317322514718,3.5550000000000002,3.6153926039177997,3.7528000000000001]
["1985-09-10",2.9032924274199998,2.9178088899872003,3.0082609654415999,3.3120953226811998,3.5339999999999998,3.5940838066451999,3.7307000000000001]
["1985-10-10",2.8860792312100001,2.9005096277936002,2.9904254261207996,3.2924583938906,3.5131000000000001,3.5727750093725996,3.7084999999999999]
["1985-11-10",2.8688660350094999,2.8832103655662,2.9725898868479996,3.2728214651487,3.4921000000000002,3.5514662120915994,3.6863999999999999]
["1985-12-13",2.8648933223992001,2.8792177893923205,2.9684735408128002,3.2682893681643206,3.4872999999999998,3.5465482569017603,3.6812999999999998]
["1986-01-13",2.8612043749753502,2.87551039723086,2.9646512194943999,3.2640809923931102,3.4828000000000001,3.5419815842254798,3.6766000000000001]
["1986-02-13",2.85723166236505,2.8715178210569801,2.9605348734591996,3.2595488954087299,3.4779,3.5370636290356399,3.6715]
["1986-03-13",2.8532589497547503,2.8675252448831006,2.9564185274240002,3.2550167984243505,3.4731000000000001,3.5321456738458004,3.6663999999999999]
["1986-04-13",2.8492862371444501,2.8635326687092202,2.9523021813888,3.2504847014399703,3.4683000000000002,3.52722771865596,3.6613000000000002]
["1986-05-13",2.8455972897206001,2.8598252765477601,2.9484798600703996,3.2462763256687599,3.4638,3.5226610459796799,3.6564999999999999]
["1986-06-13",2.8416245771103004,2.8558327003738806,2.9443635140352002,3.2417442286843805,3.4588999999999999,3.5177430907898404,3.6514000000000002]
["1986-07-13",2.8376518644568001,2.8518401241833997,2.9402471679948996,3.2372121317102995,3.4540999999999999,3.5128251356104996,3.6463000000000001]
["1986-08-22",2.8304257186707202,2.84457784766736,2.93275976090696,3.2289684965071199,3.4453,3.5038796455491998,3.637]
["1986-09-22",2.8231995728846404,2.8373155711513203,2.92527235381902,3.2207248613039399,3.4365000000000001,3.4949341554879001,3.6276999999999999]
["1986-10-22",2.8156954984144797,2.8297739763077399,2.9174969695353896,3.2121641632083295,3.4274,3.4856446081165497,3.6181000000000001]
["1986-11-22",2.8084693526283999,2.8225116997917001,2.91000956244745,3.2039205280051499,3.4186000000000001,3.47669911805525,3.6088]
["1986-12-22",2.8012432068423201,2.81524942327566,2.90252215535951,3.1956768928019699,3.4098000000000002,3.4677536279939503,3.5994999999999999]
["1987-01-22",2.7940170610562403,2.8079871467596202,2.8950347482715704,3.1874332575987903,3.4009999999999998,3.4588081379326501,3.5901999999999998]
["1987-02-22",2.78651298658608,2.8004455519160398,2.8872593639879396,3.1788725595031795,3.3919000000000001,3.4495185905612997,3.5806]
["1987-03-22",2.7792868408228002,2.7931832754260002,2.8797719569194005,3.1706289242914001,3.3831000000000002,3.4405731004610001,3.5712999999999999]
["1987-04-27",2.7699514243709,2.7838011818905,2.8700990184844501,3.15997901907545,3.3717000000000001,3.4290164729642498,3.5592999999999999]
["1987-05-27",2.7606160079189999,2.7744190883549997,2.8604260800494998,3.1493291138594999,3.3603000000000001,3.4174598454674996,3.5472999999999999]
["1987-06-27",2.7512805914671001,2.7650369948195004,2.8507531416145504,3.1386792086435502,3.3490000000000002,3.4059032179707502,3.5352999999999999]
["1987-07-27",2.7419451750152,2.7556549012840001,2.8410802031796001,3.1280293034276001,3.3376000000000001,3.394346590474,3.5232999999999999]
["1987-08-27",2.7326097585632998,2.7462728077484999,2.8314072647446502,3.11737939821165,3.3262,3.3827899629772498,3.5112999999999999]
["1987-09-27",2.7232743421113996,2.7368907142129997,2.8217343263096999,3.1067294929956999,3.3149000000000002,3.3712333354804995,3.4992999999999999]
["1987-10-27",2.7139389256595003,2.7275086206775003,2.8120613878747505,3.0960795877797502,3.3035000000000001,3.3596767079837502,3.4872999999999998]
["1987-11-27",2.7046035092076002,2.7181265271420001,2.8023884494398001,3.0854296825638001,3.2921999999999998,3.3481200804869999,3.4752999999999998]
["1987-12-27",2.6952680927557,2.7087444336064999,2.7927155110048503,3.07477977734785,3.2808000000000002,3.3365634529902497,3.4634]
["1988-01-27",2.6859326763037998,2.6993623400709996,2.7830425725699,3.0641298721318999,3.2694000000000001,3.3250068254934995,3.4514]
["1988-02-27",2.6765972598519001,2.6899802465355003,2.7733696341349505,3.0534799669159502,3.2581000000000002,3.3134501979967501,3.4394]
["1988-03-27",2.6672618434328998,2.6805981530042997,2.7636966956535001,3.0428300617169999,3.2467000000000001,3.3018935704910994,3.4274]
["1988-04-26",2.6549204052527102,2.6681950076315699,2.75090905277465,3.0287508669083003,3.2317,3.2866156871148897,3.4115000000000002]
["1988-05-26",2.6425789670725197,2.6557918622588397,2.7381214098958,3.0146716720995999,3.2166999999999999,3.2713378037386796,3.3956]
["1988-06-26",2.6302375288923301,2.6433887168861099,2.72533376701695,3.0005924772909003,3.2016,3.2560599203624698,3.3797999999999999]
["1988-07-26",2.6176442246268299,2.6307324460976096,2.71228515183445,2.9862259519758996,3.1863000000000001,3.2404702434479695,3.3635999999999999]
["1988-08-26",2.6053027864466403,2.6183293007248798,2.6994975089555999,2.9721467571672,3.1713,3.2251923600717598,3.3477000000000001]
["1988-09-26",2.5929613482664502,2.60592615535215,2.6867098660767503,2.9580675623585004,3.1562999999999999,3.2099144766955501,3.3319000000000001]
["1988-10-26",2.5806199100862601,2.5935230099794198,2.6739222231978999,2.9439883675498,3.1412,3.1946365933193395,3.3159999999999998]
["1988-11-26",2.5682784719060701,2.58111986460669,2.6611345803190503,2.9299091727411004,3.1261999999999999,3.1793587099431302,3.3001999999999998]
["1988-12-26",2.5556851676405699,2.5684635938181897,2.6480859651365498,2.9155426474260997,3.1109,3.1637690330286294,3.2839999999999998]
["1989-01-26",2.5433437294603802,2.5560604484454599,2.6352983222577002,2.9014634526174001,3.0958999999999999,3.1484911496524197,3.2681]
["1989-02-26",2.5310022912801897,2.5436573030727296,2.6225106793788497,2.8873842578086997,3.0808,3.1332132662762096,3.2523]
["1989-03-26",2.5186608530696004,2.5312541576868002,2.6097230365016002,2.8733050629552004,3.0657999999999999,3.1179353829412002,3.2364000000000002]
["1989-04-25",2.5039140469596206,2.5164336175442101,2.5944430596150205,2.8564818084044403,3.0478999999999998,3.0996798133198902,3.2174999999999998]
["1989-05-25",2.4889331645621802,2.5013778307326895,2.5789205434127802,2.8393915180671598,3.0295999999999998,3.0811344727522099,3.1981999999999999]
["1989-06-25",2.4741863584521999,2.4865572905900999,2.5636405665262001,2.8225682635164002,3.0116999999999998,3.0628789031308998,3.1793]
["1989-07-25",2.4594395523422201,2.4717367504475098,2.54836058963962,2.8057450089656402,2.9937,3.0446233335095898,3.1602999999999999]
["1989-08-25",2.4444586699447801,2.4566809636359901,2.5328380734373801,2.7886547186283601,2.9754999999999998,3.0260779929419099,3.1410999999999998]
["1989-09-25",2.4297118638348003,2.4418604234934,2.5175580965508004,2.7718314640776001,2.9575,3.0078224233206003,3.1221000000000001]
["1989-10-25",2.4149650577248205,2.42703988335081,2.5022781196642203,2.7550082095268404,2.9396,2.9895668536992903,3.1032000000000002]
["1989-11-25",2.3999841753273805,2.4119840965392902,2.4867556034619804,2.7379179191895604,2.9214000000000002,2.9710215131316104,3.0838999999999999]
["1989-12-25",2.3852373692173998,2.3971635563966998,2.4714756265753999,2.7210946646387999,2.9034,2.9527659435103,3.0649999999999999]
["1990-01-25",2.37049056310742,2.3823430162541097,2.4561956496888202,2.7042714100880398,2.8855,2.9345103738889899,3.0459999999999998]
["1990-02-25",2.35550968070998,2.36728722944259,2.4406731334865803,2.6871811197507602,2.8672,2.9159650333213101,3.0268000000000002]
["1990-03-25",2.3407628746316997,2.3524666892749,2.4253931565547,2.6703578651579001,2.8492999999999999,2.8977094637078999,3.0078]
["1990-04-24",2.3215555327388699,2.3331633106703906,2.4054913732141703,2.6484460017016902,2.8258999999999999,2.87393204610669,2.9830999999999999]
["1990-05-24",2.3023481908460397,2.3138599320658804,2.3855895898736401,2.6265341382454799,2.8025000000000002,2.85015462850548,2.9584999999999999]
["1990-06-24",2.2833519186443398,2.2947686785009807,2.36590650744894,2.6048630644975801,2.7793999999999999,2.8266385012075799,2.9340999999999999]
["1990-07-24",2.2641445767515096,2.2754652998964704,2.3460047241084099,2.5829512010413698,2.7559999999999998,2.8028610836063699,2.9094000000000002]
["1990-08-24",2.2449372348586798,2.2561619212919606,2.3261029407678802,2.5610393375851603,2.7326000000000001,2.7790836660051599,2.8847]
["1990-09-24",2.22572989296585,2.2368585426874503,2.30620115742735,2.53912747412895,2.7092000000000001,2.7553062484039499,2.86]
["1990-10-24",2.2065225510730202,2.2175551640829405,2.2862993740868203,2.5172156106727401,2.6859000000000002,2.7315288308027399,2.8353000000000002]
["1990-11-24",2.18731520918019,2.1982517854784303,2.2663975907462901,2.4953037472165298,2.6625000000000001,2.7077514132015299,2.8106]
["1990-12-24",2.1683189369784901,2.1791605319135305,2.24671450832159,2.47363267346863,2.6394000000000002,2.6842352859036303,2.7862]
["1991-01-24",2.1491115950856599,2.1598571533090203,2.2268127249810599,2.4517208100124201,2.6160000000000001,2.6604578683024198,2.7616000000000001]
["1991-02-24",2.1299042531928301,2.1405537747045105,2.2069109416405301,2.4298089465562103,2.5926,2.6366804507012103,2.7368999999999999]
["1991-03-24",2.1106969112774996,2.1212503960550997,2.1870091582868998,2.4078970831271995,2.5691999999999999,2.6129030331074996,2.7122000000000002]
["1991-04-22",2.1038031845740002,2.1143222007173601,2.1798661888938402,2.4000326738259199,2.5608,2.6043690558620001,2.7033]
["1991-05-22",2.0969094578704999,2.1073940053796196,2.1727232195007802,2.3921682645246398,2.5524,2.5958350786164996,2.6945000000000001]
["1991-06-22",2.0900157311669996,2.1004658100418796,2.1655802501077202,2.3843038552233597,2.5440999999999998,2.5873011013709997,2.6856]
["1991-07-22",2.0829192477957501,2.09333384425303,2.1582271933795703,2.3762081397661601,2.5354000000000001,2.5785161247947501,2.6764999999999999]
["1991-08-22",2.0760255210922498,2.08640564891529,2.1510842239865102,2.36834373046488,2.5270000000000001,2.5699821475492497,2.6676000000000002]
["1991-09-22",2.0691317943887499,2.0794774535775495,2.1439412545934502,2.3604793211635999,2.5186000000000002,2.5614481703037497,2.6587999999999998]
["1991-10-22",2.0622380676852496,2.0725492582398095,2.1367982852003897,2.3526149118623199,2.5102000000000002,2.5529141930582497,2.6499000000000001]
["1991-11-22",2.0553443409817498,2.0656210629020699,2.1296553158073301,2.3447505025610398,2.5017999999999998,2.5443802158127498,2.6410999999999998]
["1991-12-22",2.0484506142782499,2.0586928675643299,2.1225123464142701,2.3368860932597597,2.4935,2.5358462385672498,2.6322000000000001]
["1992-01-22",2.0413541309069996,2.0515609017754795,2.1151592896861198,2.3287903778025596,2.4847999999999999,2.5270612619909998,2.6231]
["1992-02-22",2.0344604042035002,2.0446327064377399,2.1080163202930602,2.32092596850128,2.4763999999999999,2.5185272847454998,2.6141999999999999]
["1992-03-22",2.0275666775336001,2.0377045110631999,2.1008733508728001,2.3130615591971999,2.468,2.5099933074608001,2.6053999999999999]
["1992-04-28",2.0216953454557998,2.0318038223245996,2.0947897407833995,2.3063635044891,2.4609000000000001,2.5027249870723995,2.5977999999999999]
["1992-05-28",2.0158240133779999,2.025903133586,2.0887061306939998,2.2996654497810001,2.4537,2.4954566666839999,2.5903]
["1992-06-28",2.0099526813001996,2.0200024448473997,2.0826225206045996,2.2929673950728997,2.4466000000000001,2.4881883462955998,2.5827]
["1992-07-28",2.0040813492224001,2.0141017561088002,2.0765389105151999,2.2862693403648002,2.4394,2.4809200259072002,2.5752000000000002]
["1992-08-28",1.9982100171445998,2.0082010673701998,2.0704553004257997,2.2795712856566999,2.4323000000000001,2.4736517055187996,2.5676999999999999]
["1992-09-28",1.9923386850667999,2.0023003786315998,2.0643716903364,2.2728732309485999,2.4251999999999998,2.4663833851304,2.5600999999999998]
["1992-10-28",1.9864673529889998,1.9963996898929997,2.0582880802469998,2.2661751762404996,2.4180000000000001,2.4591150647419999,2.5526]
["1992-11-28",1.9805960209111999,1.9904990011543999,2.0522044701576001,2.2594771215324001,2.4108999999999998,2.4518467443535998,2.5449999999999999]
["1992-12-28",1.9747246888333998,1.9845983124157998,2.0461208600681995,2.2527790668242997,2.4037000000000002,2.4445784239651998,2.5375000000000001]
["1993-01-28",1.9688533567555999,1.9786976236772,2.0400372499787998,2.2460810121161998,2.3965999999999998,2.4373101035768001,2.5299]
["1993-02-28",1.9629820246777998,1.9727969349385996,2.0339536398893996,2.2393829574080999,2.3894000000000002,2.4300417831883996,2.5224000000000002]
["1993-03-28",1.9571106925542001,1.9668962461599999,2.0278700297706003,2.2326849027247997,2.3822999999999999,2.4227734628074002,2.5148000000000001]
["1993-04-27",1.9542269341663498,1.9639980689799998,2.0248820090980502,2.2293950919643999,2.3788,2.4192035608484499,2.5110999999999999]
["1993-05-27",1.9513431757784998,1.9610998917999998,2.0218939884255001,2.2261052812039996,2.3753000000000002,2.4156336588895,2.5074000000000001]
["1993-06-27",1.9484594173906502,1.9582017146200001,2.0189059677529504,2.2228154704435998,2.3717000000000001,2.4120637569305501,2.5036999999999998]
["1993-07-27",1.9455756590028002,1.9553035374399999,2.0159179470804003,2.2195256596832,2.3681999999999999,2.4084938549716002,2.5]
["1993-08-27",1.9426919006149499,1.9524053602599998,2.0129299264078502,2.2162358489227998,2.3647,2.4049239530126498,2.4963000000000002]
["1993-09-27",1.9398081422270999,1.9495071830799997,2.0099419057353001,2.2129460381623995,2.3612000000000002,2.4013540510536999,2.4925999999999999]
["1993-10-27",1.9369243838392503,1.9466090059000001,2.0069538850627504,2.2096562274020002,2.3576999999999999,2.39778414909475,2.4889000000000001]
["1993-11-27",1.9340406254514,1.94371082872,2.0039658643902003,2.2063664166415999,2.3542000000000001,2.3942142471358001,2.4851999999999999]
["1993-12-27",1.9311568670635499,1.9408126515399999,2.0009778437176502,2.2030766058811997,2.3506999999999998,2.3906443451768498,2.4815]
["1994-01-27",1.9282731086756999,1.9379144743599996,1.9979898230450999,2.1997867951207994,2.3472,2.3870744432178999,2.4777999999999998]
["1994-02-27",1.9254124203549527,1.93503948259744,1.9950257065379304,2.196523302846483,2.3437000000000001,2.3835331004746214,2.4741]
["1994-03-27",1.9225055918908001,1.9321181199964002,1.9920137816936001,2.1932071736049998,2.3401999999999998,2.3799346393312,2.4704000000000002]
["1994-04-26",1.9191195742142799,1.9287151722312401,1.9885053425477601,2.1893443821054999,2.3359999999999999,2.3757429736259197,2.4660000000000002]
["1994-05-26",1.9155454444446198,1.9251231718124602,1.9848019901160401,2.1852669910782501,2.3317000000000001,2.3713184376036796,2.4613999999999998]
["1994-06-26",1.9121594267680999,1.9217202240473001,1.9812935509702001,2.1814041995787501,2.3275999999999999,2.3671267718983997,2.4571000000000001]
["1994-07-26",1.9087734090915798,1.9183172762821399,1.9777851118243599,2.1775414080792497,2.3233999999999999,2.3629351061931194,2.4527000000000001]
["1994-08-26",1.9051992793219197,1.9147252758633599,1.9740817593926399,2.1734640170519999,2.3191000000000002,2.3585105701708797,2.4481000000000002]
["1994-09-26",1.9018132616453998,1.9113223280981999,1.9705733202467999,2.1696012255524999,2.3149999999999999,2.3543189044655994,2.4438]
["1994-10-26",1.8984272439688801,1.9079193803330403,1.9670648811009603,2.1657384340530004,2.3108,2.35012723876032,2.4394]
["1994-11-26",1.89485311419922,1.9043273799142604,1.9633615286692403,2.1616610430257501,2.3065000000000002,2.3457027027380799,2.4348000000000001]
["1994-12-26",1.8914670965227001,1.9009244321491001,1.9598530895234003,2.1577982515262502,2.3024,2.3415110370328001,2.4304999999999999]
["1995-01-26",1.8880810788461799,1.8975214843839401,1.9563446503775601,2.1539354600267502,2.2982,2.3373193713275198,2.4260999999999999]
["1995-02-26",1.8845069490765201,1.8939294839651601,1.9526412979458401,2.1498580689994999,2.2938999999999998,2.3328948353052796,2.4215]
["1995-03-26",1.8811209313896997,1.8905265362424999,1.9491328587802998,2.1459952775194999,2.2898000000000001,2.3287031696397,2.4171999999999998]
["1995-04-24",1.87532729618234,1.8847039328585,1.9431297546916602,2.1393858599179003,2.2827000000000002,2.3215310328323402,2.4097]
["1995-05-24",1.8693526098747499,1.87869937311875,1.93693905360025,2.13256989801625,2.2755000000000001,2.31413476674975,2.4020999999999999]
["1995-06-24",1.8635589746673902,1.8728767697347501,1.9309359495116101,2.1259604804146504,2.2684000000000002,2.3069626299423902,2.3946000000000001]
["1995-07-24",1.8575842883597999,1.8668722099949999,1.9247452484202001,2.1191445185130005,2.2610999999999999,2.2995663638598001,2.3868999999999998]
["1995-08-24",1.8517906531524397,1.8610496066109998,1.9187421443315598,2.1125351009114,2.2541000000000002,2.2923942270524398,2.3795000000000002]
["1995-09-24",1.8458159668448502,1.85504504687125,1.91255144324015,2.1057191390097505,2.2467999999999999,2.2849979609698501,2.3717999999999999]
["1995-10-24",1.84002233163749,1.84922244348725,1.9065483391515099,2.09910972140815,2.2397999999999998,2.2778258241624902,2.3643999999999998]
["1995-11-24",1.8340476453298997,1.8432178837474997,1.9003576380600997,2.0922937595065001,2.2324999999999999,2.2704295580799001,2.3567]
["1995-12-24",1.82825401012254,1.8373952803635001,1.89435453397146,2.0856843419049,2.2254,2.2632574212725403,2.3492999999999999]
["1996-01-24",1.8222793238149499,1.8313907206237499,1.8881638328800499,2.0788683800032501,2.2181999999999999,2.2558611551899501,2.3416000000000001]
["1996-02-24",1.8164856886075902,1.8255681172397502,1.8821607287914102,2.0722589624016505,2.2111000000000001,2.2486890183825903,2.3340999999999998]
["1996-03-24",1.8105110022702997,1.8195635574638998,1.8759700277218998,2.0654430004871998,2.2038000000000002,2.2412927522828996,2.3264999999999998]
["1996-04-23",1.8074964393869901,1.81653392176587,1.8728464733172703,2.0620039670877603,2.2002000000000002,2.2375609230185702,2.3226]
["1996-05-23",1.8043045492752501,1.81332607220325,1.8695391804182502,2.0583626376060002,2.1962999999999999,2.23360957438575,2.3184999999999998]
["1996-06-23",1.80128998639194,1.8102964365052201,1.8664156260136202,2.05492360420656,2.1926000000000001,2.2298777451214202,2.3146]
["1996-07-23",1.7980980962802,1.8070885869425999,1.8631083331146001,2.0512822747247998,2.1886999999999999,2.2259263964886,2.3105000000000002]
["1996-08-23",1.79508353339689,1.8040589512445699,1.8599847787099699,2.04784324132536,2.1850000000000001,2.2221945672242698,2.3066]
["1996-09-23",1.7918916432851499,1.80085110168195,1.85667748581095,2.0442019118435999,2.1812,2.21824321859145,2.3025000000000002]
["1996-10-23",1.7888770804018399,1.7978214659839198,1.8535539314063199,2.04076287844416,2.1775000000000002,2.2145113893271198,2.2987000000000002]
["1996-11-23",1.7856851902900999,1.7946136164212998,1.8502466385073,2.0371215489623999,2.1736,2.2105600406942996,2.2946]
["1996-12-23",1.7826706274067901,1.7915839807232701,1.8471230841026702,2.0336825155629601,2.1699000000000002,2.2068282114299702,2.2907000000000002]
["1997-01-23",1.77947873729505,1.7883761311606501,1.8438157912036501,2.0300411860812,2.1661000000000001,2.20287686279715,2.2866]
["1997-02-23",1.77646417441174,1.7853464954626199,1.8406922367990202,2.0266021526817601,2.1623999999999999,2.1991450335328202,2.2827000000000002]
["1997-03-23",1.7732722843276001,1.7821386459352,1.8373849438615999,2.0229608232428,2.1585000000000001,2.1951936849388001,2.2786]
["1997-04-22",1.7681373259752999,1.7769780127905999,1.8320643310897997,2.0171028285808998,2.1522000000000001,2.1888369464688999,2.2719999999999998]
["1997-05-22",1.763002367623,1.7718173796459999,1.826743718318,2.0112448339190001,2.1459999999999999,2.1824802079990002,2.2654000000000001]
["1997-06-22",1.7578674092706998,1.7666567465013998,1.8214231055461998,2.0053868392570999,2.1396999999999999,2.1761234695291001,2.2587999999999999]
["1997-07-22",1.7527324509184001,1.7614961133567999,1.8161024927744001,1.9995288445952002,2.1335000000000002,2.1697667310591999,2.2522000000000002]
["1997-08-22",1.7475974925660998,1.7563354802121998,1.8107818800025999,1.9936708499333,2.1272000000000002,2.1634099925892998,2.2456]
["1997-09-22",1.7424625342138,1.7511748470675998,1.8054612672307999,1.9878128552714001,2.121,2.1570532541194001,2.2389999999999999]
["1997-10-22",1.7373275758614999,1.7460142139229997,1.8001406544589997,1.9819548606094999,2.1147,2.1506965156494999,2.2324000000000002]
["1997-11-22",1.7321926175092,1.7408535807784,1.7948200416872,1.9760968659476001,2.1084999999999998,2.1443397771796002,2.2258]
["1997-12-22",1.7270576591568998,1.7356929476337997,1.7894994289153998,1.9702388712857,2.1021999999999998,2.1379830387097001,2.2191999999999998]
["1998-01-22",1.7219227008046001,1.7305323144892,1.7841788161435999,1.9643808766238,2.0960000000000001,2.1316263002397999,2.2126000000000001]
["1998-02-22",1.7167877424522997,1.7253716813445998,1.7788582033717997,1.9585228819618998,2.0897000000000001,2.1252695617698998,2.206]
["1998-03-22",1.7116527841344,1.7202110481624,1.7735375905608002,1.9526648873448,2.0834999999999999,2.1189128233031997,2.1993999999999998]
["1998-04-28",1.70717462278056,1.7157104960015102,1.7688975212831701,1.9475561710697702,2.0779999999999998,2.1133691560329302,2.1937000000000002]
["1998-05-28",1.7028623192546397,1.7113766309576899,1.7644293064232299,1.9426366665086299,2.0728,2.1080308097726697,2.1880999999999999]
["1998-06-28",1.6983841579007999,1.7068760787968,1.7597892371456001,1.9375279502336,2.0672999999999999,2.1024871425023997,2.1823999999999999]
["1998-07-28",1.6939059965469601,1.70237552663591,1.7551491678679703,1.9324192339585702,2.0619000000000001,2.0969434752321301,2.1766000000000001]
["1998-08-28",1.6895936930210398,1.6980416615920897,1.7506809530080298,1.9274997293974299,2.0566,2.0916051289718696,2.1711]
["1998-09-28",1.6851155316672,1.6935411094311998,1.7460408837304,1.9223910131224,2.0512000000000001,2.0860614617016,2.1652999999999998]
["1998-10-28",1.6806373703133601,1.68904055727031,1.7414008144527702,1.9172822968473702,2.0457000000000001,2.08051779443133,2.1596000000000002]
["1998-11-28",1.6763250667874399,1.6847066922264897,1.73693259959283,1.9123627922862299,2.0405000000000002,2.0751794481710695,2.1539999999999999]
["1998-12-28",1.6718469054335998,1.6802061400655999,1.7322925303152001,1.9072540760112,2.0350000000000001,2.0696357809007999,2.1482999999999999]
["1999-01-28",1.66736874407976,1.67570558790471,1.7276524610375701,1.9021453597361702,2.0295999999999998,2.0640921136305299,2.1425000000000001]
["1999-02-28",1.6630564405538397,1.6713717228608898,1.7231842461776299,1.8972258551750298,2.0243000000000002,2.0587537673702698,2.137]
["1999-03-28",1.6585782792485999,1.6668711707327999,1.7185441768952998,1.8921171388604998,2.0188999999999999,2.0532101000672998,2.1312000000000002]
["1999-04-26",1.65710180006826,1.6653873091564799,1.71701431561023,1.8904327615855501,2.0171000000000001,2.0513823165954301,2.1293000000000002]
["1999-05-26",1.6556253208879201,1.6639034475801602,1.7154844543251602,1.8887483843106003,2.0152999999999999,2.0495545331235601,2.1274000000000002]
["1999-06-26",1.65414884170758,1.66241958600384,1.7139545930400901,1.8870640070356501,2.0135000000000001,2.04772674965169,2.1255000000000002]
["1999-07-26",1.6525083092849802,1.6607708509190402,1.7122547471677902,1.8851924767301502,2.0114999999999998,2.0456958791273903,2.1234000000000002]
["1999-08-26",1.6510318301046398,1.65928698934272,1.71072488588272,1.8835080994552,2.0097,2.0438680956555197,2.1215000000000002]
["1999-09-26",1.6495553509243002,1.6578031277664,1.7091950245976502,1.8818237221802503,2.0078999999999998,2.0420403121836501,2.1196000000000002]
["1999-10-26",1.6480788717439598,1.6563192661900799,1.7076651633125799,1.8801393449052999,2.0061,2.04021252871178,2.1177000000000001]
["1999-11-26",1.64660239256362,1.6548354046137601,1.7061353020275101,1.8784549676303501,2.0043000000000002,2.03838474523991,2.1158000000000001]
["1999-12-26",1.6451259133832798,1.6533515430374399,1.7046054407424398,1.8767705903553999,2.0024999999999999,2.0365569617680399,2.1139000000000001]
["2000-01-26",1.64348538096068,1.6517028079526399,1.7029055948701401,1.8748990600499003,2.0005000000000002,2.0345260912437402,2.1118000000000001]
["2000-02-26",1.6420089017803399,1.6502189463763197,1.7013757335850699,1.8732146827749498,1.9986999999999999,2.0326983077718697,2.1099000000000001]
["2000-03-26",1.6405324225599998,1.6487350847760998,1.6998458723083998,1.8715303054788999,1.9968999999999999,2.0308705242823,2.1080000000000001]
["2000-04-25",1.636244486896,1.64442570943351,1.6954029063304401,1.8666385999369901,1.9917,2.0255623438219299,2.1025]
["2000-05-25",1.6317977388,1.6399567275967499,1.6907953860570002,1.8615657201157503,1.9863,2.0200575640852501,2.0968]
["2000-06-25",1.6275098031359998,1.6356473522541597,1.6863524200790398,1.8566740145738401,1.9811000000000001,2.01474938362488,2.0912999999999999]
["2000-07-25",1.62306305504,1.6311783704173999,1.6817448998055999,1.8516011347526002,1.9757,2.0092446038882001,2.0855999999999999]
["2000-08-25",1.618775119376,1.6268689950748101,1.6773019338276403,1.8467094292106903,1.9703999999999999,2.0039364234278301,2.0800999999999998]
["2000-09-25",1.6143283712799998,1.6224000132380498,1.6726944135541999,1.84163654938945,1.9650000000000001,1.99843164369115,2.0743999999999998]
["2000-10-25",1.6100404356160001,1.61809063789546,1.66825144757624,1.8367448438475402,1.9598,1.9931234632307802,2.0689000000000002]
["2000-11-25",1.6055936875199999,1.6136216560586998,1.6636439273027999,1.8316719640262999,1.9543999999999999,1.9876186834940999,2.0630999999999999]
["2000-12-25",1.6013057518559999,1.6093122807161098,1.65920096132484,1.82678025848439,1.9492,1.98231050303373,2.0575999999999999]
["2001-01-25",1.5968590037600001,1.60484329887935,1.6545934410514,1.8217073786631501,1.9438,1.9768057232970502,2.0518999999999998]
["2001-02-25",1.5925710680959997,1.6005339235367597,1.6501504750734399,1.8168156731212399,1.9384999999999999,1.9714975428366799,2.0464000000000002]
["2001-03-25",1.5881243200424999,1.5960649417316999,1.6455429548306997,1.8117427933223997,1.9331,1.9659927631301999,2.0407000000000002]
["2001-04-24",1.5859381115390001,1.5938678021855601,1.64327770395876,1.8092487521123199,1.9305000000000001,1.9632863817453603,2.0379]
["2001-05-24",1.5837519030355001,1.5916706626394201,1.64101245308682,1.8067547109022399,1.9278,1.96058000036052,2.0350999999999999]
["2001-06-24",1.581565694532,1.5894735230932799,1.6387472022148799,1.8042606696921597,1.9251,1.95787361897568,2.0323000000000002]
["2001-07-24",1.5792233282782502,1.5871194450081303,1.6363201477092302,1.8015884826813602,1.9222999999999999,1.9549739246347801,2.0293000000000001]
["2001-08-24",1.5770371197747501,1.5849223054619901,1.6340548968372899,1.7990944414712799,1.9196,1.9522675432499401,2.0265]
["2001-09-24",1.5748509112712499,1.5827251659158501,1.6317896459653498,1.7966004002611999,1.917,1.9495611618651001,2.0236000000000001]
["2001-10-24",1.5726647027677503,1.5805280263697103,1.6295243950934102,1.7941063590511201,1.9142999999999999,1.9468547804802603,2.0207999999999999]
["2001-11-24",1.57047849426425,1.5783308868235701,1.6272591442214701,1.7916123178410399,1.9117,1.9441483990954203,2.0179999999999998]
["2001-12-24",1.56829228576075,1.5761337472774302,1.6249938933495298,1.7891182766309599,1.909,1.94144201771058,2.0152000000000001]
["2002-01-24",1.5659499195069999,1.5737796691922801,1.6225668388438799,1.7864460896201597,1.9060999999999999,1.9385423233696799,2.0122]
["2002-02-24",1.5637637110035001,1.5715825296461403,1.62030158797194,1.7839520484100799,1.9035,1.9358359419848401,2.0093999999999999]
["2002-03-24",1.5615775025306999,1.5693853900580998,1.6180363370600999,1.7814580071587998,1.9008,1.9331295605945999,2.0066000000000002]
["2002-04-23",1.5594278383187601,1.5672249775250802,1.61580895173868,1.7790056559198402,1.8982000000000001,1.9304684186232801,2.0038]
["2002-05-23",1.55727817410682,1.56506456499206,1.6135815664172599,1.7765533046808799,1.8956,1.9278072766519601,2.0011000000000001]
["2002-06-23",1.5551285098948799,1.5629041524590399,1.6113541810958398,1.7741009534419199,1.893,1.92514613468064,1.9983]
["2002-07-23",1.5528252982392301,1.5605894247450902,1.6089676968228901,1.7714734342573202,1.8902000000000001,1.9222949111399401,1.9953000000000001]
["2002-08-23",1.55067563402729,1.5584290122120701,1.60674031150147,1.7690210830183601,1.8875,1.9196337691686201,1.9925999999999999]
["2002-09-23",1.54852596981535,1.55626859967905,1.6045129261800499,1.7665687317793999,1.8849,1.9169726271973,1.9898]
["2002-10-23",1.5463763056034101,1.5541081871460303,1.6022855408586301,1.7641163805404403,1.8823000000000001,1.9143114852259802,1.9871000000000001]
["2002-11-23",1.54422664139147,1.5519477746130101,1.60005815553721,1.76166402930148,1.8796999999999999,1.9116503432546601,1.9843]
["2002-12-23",1.54207697717953,1.54978736207999,1.5978307702157899,1.75921167806252,1.8771,1.90898920128334,1.9815]
["2003-01-23",1.5397737655238799,1.5474726343660399,1.5954442859428399,1.7565841588779199,1.8743000000000001,1.9061379777426399,1.9785999999999999]
["2003-02-23",1.5376241013119401,1.5453122218330202,1.5932169006214201,1.75413180763896,1.8716999999999999,1.9034768357713201,1.9758]
["2003-03-23",1.5354744371336,1.5431518093387999,1.5909895152739999,1.7516794563984002,1.869,1.9008156938036,1.9730000000000001]
["2003-04-28",1.5320390371283399,1.5396992323334702,1.5874299083818499,1.7477603292099602,1.8649,1.8965628960450902,1.9685999999999999]
["2003-05-28",1.5284542719054601,1.5360965432844302,1.58371553597265,1.7436708051872403,1.8605,1.8921251940362103,1.964]
["2003-06-28",1.5250188719001998,1.5326439662790998,1.5801559290804998,1.7397516779988,1.8563000000000001,1.8878723962776998,1.9596]
["2003-07-28",1.5215834718949399,1.5291913892737699,1.5765963221883499,1.73583255081036,1.8521000000000001,1.8836195985191899,1.9552]
["2003-08-28",1.5179987066720599,1.5255887002247299,1.57288194977915,1.7317430267876401,1.8478000000000001,1.87918189651031,1.9505999999999999]
["2003-09-28",1.5145633066667998,1.5221361232194,1.569322342887,1.7278238995992001,1.8435999999999999,1.8749290987518001,1.9461999999999999]
["2003-10-28",1.51112790666154,1.51868354621407,1.5657627359948501,1.7239047724107601,1.8393999999999999,1.8706763009932901,1.9418]
["2003-11-28",1.50754314143866,1.51508085716503,1.5620483635856501,1.7198152483880402,1.835,1.8662385989844101,1.9372]
["2003-12-28",1.5041077414333996,1.5116282801596999,1.5584887566934997,1.7158961211996,1.8309,1.8619858012258999,1.9327000000000001]
["2004-01-28",1.5006723414281398,1.5081757031543699,1.5549291498013498,1.71197699401116,1.8267,1.8577330034673898,1.9282999999999999]
["2004-02-28",1.4970875762052598,1.50457301410533,1.5512147773921499,1.7078874699884401,1.8223,1.8532953014585098,1.9237]
["2004-03-28",1.493652176169,1.501120437055,1.5476551705469999,1.7039683428371999,1.8181,1.8490425037093998,1.9193]
["2004-04-27",1.4898854490516,1.497334876302,1.5437522574108,1.6996712354740799,1.8134999999999999,1.8443795449221601,1.9145000000000001]
["2004-05-27",1.4861187219342002,1.4935493155490001,1.5398493442746,1.69537412811096,1.8089999999999999,1.8397165861349201,1.9096]
["2004-06-27",1.4824968689367002,1.4899093532865002,1.5360965431821001,1.6912422941079601,1.8046,1.8352329719164202,1.905]
["2004-07-27",1.4787301418193,1.4861237925334998,1.5321936300458998,1.68694518674484,1.8,1.8305700131291798,1.9000999999999999]
["2004-08-27",1.4749634147019002,1.4823382317805001,1.5282907169097,1.68264807938172,1.7954000000000001,1.82590705434194,1.8953]
["2004-09-27",1.4711966875845002,1.4785526710275001,1.5243878037735001,1.6783509720186001,1.7907999999999999,1.8212440955547,1.8905000000000001]
["2004-10-27",1.4674299604670999,1.4747671102744999,1.5204848906372999,1.6740538646554799,1.7862,1.8165811367674598,1.8855999999999999]
["2004-11-27",1.4636632333497002,1.4709815495215,1.5165819775011,1.6697567572923599,1.7816000000000001,1.81191817798022,1.8808]
["2004-12-27",1.4600413803522001,1.4673415872590001,1.5128291764085999,1.6656249232893601,1.7771999999999999,1.80743456376172,1.8761000000000001]
["2005-01-27",1.4562746532348003,1.4635560265060001,1.5089262632724001,1.6613278159262401,1.7726,1.8027716049744802,1.8713]
["2005-02-27",1.4525079261174001,1.459770465753,1.5050233501361998,1.65703070856312,1.7681,1.79810864618724,1.8664000000000001]
["2005-03-27",1.4487411990336998,1.4559849049616,1.5011204369693998,1.6527336011523999,1.7635000000000001,1.7934456873917999,1.8615999999999999]
["2005-04-26",1.4456377612168798,1.4528659499558401,1.4979047943585597,1.6491931786377598,1.7597,1.7896038368443199,1.8575999999999999]
["2005-05-26",1.4423932580447498,1.449605224268,1.4945429861744999,1.6454918278269999,1.7557,1.7855873567264999,1.8533999999999999]
["2005-06-26",1.4392898202279298,1.44648626926224,1.4913273435636598,1.6419514053123598,1.752,1.7817455061790199,1.8494999999999999]
["2005-07-26",1.4360453170558001,1.4432255435744001,1.4879655353796,1.6382500545015999,1.748,1.7777290260612,1.8452999999999999]
["2005-08-26",1.4329418792389801,1.4401065885686402,1.4847498927687599,1.6347096319869601,1.7442,1.77388717551372,1.8412999999999999]
["2005-09-26",1.4296973760668501,1.4368458628808003,1.4813880845847001,1.6310082811762001,1.7403,1.7698706953959,1.8371]
["2005-10-26",1.4265939382500301,1.4337269078750403,1.47817244197386,1.6274678586615601,1.7364999999999999,1.76602884484842,1.8331]
["2005-11-26",1.4233494350778999,1.4304661821872,1.4748106337897997,1.6237665078507997,1.7325999999999999,1.7620123647305999,1.829]
["2005-12-26",1.4202459972610799,1.42734722718144,1.4715949911789599,1.6202260853361599,1.7287999999999999,1.7581705141831199,1.825]
["2006-01-26",1.4170014940889499,1.4240865014935999,1.4682331829948998,1.6165247345253999,1.7248000000000001,1.7541540340652999,1.8208]
["2006-02-26",1.4138980562721299,1.42096754648784,1.4650175403840597,1.6129843120107599,1.7211000000000001,1.7503121835178199,1.8168]
["2006-03-26",1.4106535531368001,1.4177068207791998,1.4616557322304002,1.6092829612412001,1.7171000000000001,1.7462957033788,1.8127]
["2006-04-25",1.4065686490253999,1.4136014921475999,1.4574231384112,1.6046228754460998,1.7121,1.7412388625388997,1.8073999999999999]
["2006-05-25",1.4024837449140002,1.4094961635159999,1.4531905445920001,1.599962789651,1.7072000000000001,1.736182021699,1.8022]
["2006-06-25",1.3983988408026,1.4053908348843998,1.4489579507728001,1.5953027038559,1.7021999999999999,1.7311251808590997,1.7968999999999999]
["2006-07-25",1.3943139366912001,1.4012855062528,1.4447253569536,1.5906426180608,1.6972,1.7260683400192001,1.7917000000000001]
["2006-08-25",1.3902290325797999,1.3971801776211998,1.4404927631344,1.5859825322657,1.6921999999999999,1.7210114991792997,1.7864]
["2006-09-25",1.3861441284684002,1.3930748489895999,1.4362601693152002,1.5813224464706002,1.6873,1.7159546583393999,1.7811999999999999]
["2006-10-25",1.382059224357,1.3889695203579997,1.4320275754959999,1.5766623606754999,1.6822999999999999,1.7108978174994998,1.7759]
["2006-11-25",1.3779743202456001,1.3848641917264,1.4277949816768001,1.5720022748804001,1.6773,1.7058409766595999,1.7706999999999999]
["2006-12-25",1.3738894161341999,1.3807588630947998,1.4235623878576,1.5673421890852999,1.6724000000000001,1.7007841358196998,1.7654000000000001]
["2007-01-25",1.3698045120228002,1.3766535344631998,1.4193297940384002,1.5626821032902001,1.6674,1.6957272949797999,1.7602]
["2007-02-25",1.3657196079114,1.3725482058315999,1.4150972002191999,1.5580220174950998,1.6624000000000001,1.6906704541398998,1.7548999999999999]
["2007-03-25",1.3616347037502998,1.3684428771771,1.4108646064257999,1.5533619316932998,1.6574,1.6856136133349997,1.7497]
["2007-04-23",1.3574410261256602,1.3642282311646201,1.40651930638676,1.5485777563502601,1.6523000000000001,1.680422118087,1.7443]
["2007-05-23",1.3531162960752501,1.35988187746425,1.4020382157214999,1.5436440755277498,1.6471,1.6750683886125,1.7386999999999999]
["2007-06-23",1.3489226184506102,1.3556672314517701,1.3976929156824602,1.5388599001847101,1.6419999999999999,1.6698768933645001,1.7333000000000001]
["2007-07-23",1.3445978884002001,1.3513208777514001,1.3932118250172001,1.5339262193621999,1.6367,1.66452316389,1.7278]
["2007-08-23",1.34040421077556,1.34710623173892,1.38886652497816,1.5291420440191599,1.6315999999999999,1.6593316686419999,1.7223999999999999]
["2007-09-23",1.3360794807251501,1.3427598780385501,1.3843854343129001,1.5242083631966501,1.6263000000000001,1.6539779391675,1.7168000000000001]
["2007-10-23",1.3318858031005101,1.33854523202607,1.38004013427386,1.5194241878536099,1.6212,1.6487864439194999,1.7114]
["2007-11-23",1.3275610730501,1.3341988783256999,1.3755590436085998,1.5144905070310997,1.6160000000000001,1.6434327144449998,1.7059]
["2007-12-23",1.3233673954254601,1.32998423231322,1.3712137435695599,1.5097063316880599,1.6109,1.6382412191969999,1.7004999999999999]
["2008-01-23",1.31904266537505,1.32563787861285,1.3667326529043,1.5047726508655499,1.6055999999999999,1.6328874897224999,1.6949000000000001]
["2008-02-23",1.3148489877504101,1.3214232326003701,1.3623873528652601,1.4999884755225101,1.6005,1.6276959944745,1.6895]
["2008-03-23",1.310524257735,1.317076878915,1.3579062621600002,1.4950547946600001,1.5952,1.6223422649700001,1.6839999999999999]
["2008-04-22",1.3052821607040601,1.3118085713993399,1.3524746371113601,1.4890745754813601,1.5888,1.6158528959101202,1.6773]
["2008-05-22",1.3001648755071902,1.3066656997769099,1.3471723364686401,1.4832367424736401,1.5826,1.6095180356373802,1.6707000000000001]
["2008-06-22",1.2949227784762503,1.3013973922612501,1.3417407114200002,1.4772565232950001,1.5762,1.6030286665775002,1.6638999999999999]
["2008-07-22",1.2896806814453101,1.2961290847455902,1.3363090863713603,1.4712763041163603,1.5699000000000001,1.5965392975176202,1.6572]
["2008-08-22",1.28456339624844,1.2909862131231598,1.3310067857286398,1.4654384711086399,1.5636000000000001,1.5902044372448798,1.6506000000000001]
["2008-09-22",1.2793212992175,1.2857179056074999,1.3255751606799999,1.4594582519299999,1.5571999999999999,1.5837150681849999,1.6438999999999999]
["2008-10-22",1.2740792021865599,1.2804495980918398,1.32014353563136,1.4534780327513599,1.5508999999999999,1.5772256991251199,1.6372]
["2008-11-22",1.26896191698969,1.2753067264694098,1.31484123498864,1.4476401997436401,1.5446,1.5708908388523799,1.6306]
["2008-12-22",1.26371981995875,1.2700384189537499,1.3094096099400001,1.4416599805650001,1.5383,1.5644014697924999,1.6237999999999999]
["2009-01-22",1.2584777229278101,1.2647701114380898,1.30397798489136,1.4356797613863601,1.5319,1.55791210073262,1.6171]
["2009-02-22",1.25336043773094,1.2596272398156598,1.29867568424864,1.4298419283786401,1.5256000000000001,1.55157724045988,1.6105]
["2009-03-22",1.2481183407000001,1.2543589323,1.2932440592000001,1.4238617092000001,1.5193000000000001,1.5450878714,1.6037999999999999]
["2009-04-28",1.2481183407000001,1.2543589323,1.2932440592000001,1.4238617092000001,1.5193000000000001,1.5450878714,1.6037999999999999]
["2009-05-28",1.2481183407000001,1.2543589323,1.2932440592000001,1.4238617092000001,1.5193000000000001,1.5450878714,1.6037999999999999]
["2009-06-28",1.2481183407000001,1.2543589323,1.2932440592000001,1.4238617092000001,1.5193000000000001,1.5450878714,1.6037999999999999]
["2009-07-28",1.2481183407000001,1.2543589323,1.2932440592000001,1.4238617092000001,1.5193000000000001,1.5450878714,1.6037999999999999]
["2009-08-28",1.2481183407000001,1.2543589323,1.2932440592000001,1.4238617092000001,1.5193000000000001,1.5450878714,1.6037999999999999]
["2009-09-28",1.2481183407000001,1.2543589323,1.2932440592000001,1.4238617092000001,1.5193000000000001,1.5450878714,1.6037999999999999]
["2009-10-28",1.2481183407000001,1.2543589323,1.2932440592000001,1.4238617092000001,1.5193000000000001,1.5450878714,1.6037999999999999]
["2009-11-28",1.2481183407000001,1.2543589323,1.2932440592000001,1.4238617092000001,1.5193000000000001,1.5450878714,1.6037999999999999]
["2009-12-28",1.2481183407000001,1.2543589323,1.2932440592000001,1.4238617092000001,1.5193000000000001,1.5450878714,1.6037999999999999]
["2010-01-28",1.2481183407000001,1.2543589323,1.2932440592000001,1.4238617092000001,1.5193000000000001,1.5450878714,1.6037999999999999]
["2010-02-28",1.2481183407000001,1.2543589323,1.2932440592000001,1.4238617092000001,1.5193000000000001,1.5450878714,1.6037999999999999]
["2010-03-28",1.2481183407251999,1.2543589322783,1.2932440592012999,1.4238617092194998,1.5193000000000001,1.5450878713640999,1.6037999999999999]
["2010-04-27",1.24497080659728,1.25119566048012,1.28998272597732,1.4202709813397998,1.5154000000000001,1.5411914325032399,1.5998000000000001]
["2010-05-27",1.2418232724693599,1.2480323886819402,1.2867213927533401,1.4166802534601,1.5116000000000001,1.5372949936423801,1.5956999999999999]
["2010-06-27",1.2387967973463601,1.2449907811836902,1.28358549542259,1.41322763049885,1.5079,1.5335484178146301,1.5918000000000001]
["2010-07-27",1.2356492632184399,1.24182750938551,1.2803241621986099,1.4096369026191498,1.5041,1.5296519789537699,1.5878000000000001]
["2010-08-27",1.2325017290905198,1.23866423758733,1.27706282897463,1.4060461747394499,1.5003,1.5257555400929099,1.5837000000000001]
["2010-09-27",1.2293541949625999,1.2355009657891503,1.27380149575065,1.4024554468597501,1.4964,1.5218591012320501,1.5797000000000001]
["2010-10-27",1.2262066608346798,1.23233769399097,1.2705401625266699,1.3988647189800498,1.4925999999999999,1.5179626623711899,1.5755999999999999]
["2010-11-27",1.2230591267067599,1.2291744221927901,1.26727882930269,1.3952739911003498,1.4887999999999999,1.5140662235103299,1.5716000000000001]
["2010-12-27",1.2200326515837598,1.2261328146945401,1.2641429319719399,1.3918213681390998,1.4851000000000001,1.51031964768258,1.5677000000000001]
["2011-01-27",1.2168851174558399,1.2229695428963603,1.26088159874796,1.3882306402594,1.4812000000000001,1.5064232088217202,1.5637000000000001]
["2011-02-27",1.2137375833279198,1.2198062710981801,1.2576202655239799,1.3846399123796997,1.4774,1.50252676996086,1.5596000000000001]
["2011-03-27",1.2105900491596002,1.2166429993144001,1.2543589322740001,1.3810491844868,1.4736,1.4986303311283999,1.5556000000000001]
["2011-04-25",1.2056418198712102,1.21167002887994,1.24923179975615,1.3754042115844303,1.4676,1.4925047508775899,1.5491999999999999]
["2011-05-25",1.2005785154830899,1.2065814079702599,1.2439854315983498,1.3696279602424699,1.4614,1.4862367152721097,1.5427]
["2011-06-25",1.1956302861946999,1.2016084375358,1.2388582990804999,1.3639829873400999,1.4554,1.4801111350212999,1.5364]
["2011-07-25",1.1906820569063101,1.1966354671013399,1.2337311665626498,1.3583380144377299,1.4493,1.4739855547704899,1.53]
["2011-08-25",1.18561875251819,1.1915468461916601,1.2284847984048499,1.35256176309577,1.4432,1.4677175191650098,1.5235000000000001]
["2011-09-25",1.1806705232298,1.1865738757572,1.223357665887,1.3469167901934,1.4372,1.4615919389142,1.5170999999999999]
["2011-10-25",1.17572229394141,1.1816009053227401,1.2182305333691501,1.3412718172910301,1.4311,1.45546635866339,1.5107999999999999]
["2011-11-25",1.1706589895532902,1.1765122844130602,1.21298416521135,1.3354955659490702,1.425,1.44919832305791,1.5043]
["2011-12-25",1.1657107602648999,1.1715393139785999,1.2078570326934999,1.3298505930466999,1.419,1.4430727428070997,1.4979]
["2012-01-25",1.1607625309765099,1.16656634354414,1.20272990017565,1.32420562014433,1.4129,1.4369471625562897,1.4916]
["2012-02-25",1.1556992265883901,1.1614777226344599,1.1974835320178498,1.31842936880237,1.4068000000000001,1.4306791269508099,1.4850000000000001]
["2012-03-25",1.1507509972868,1.1565047522251999,1.1923563994986002,1.3127843958824001,1.4007000000000001,1.424553546731,1.4786999999999999]
["2012-04-24",1.1487242342778798,1.1544678554013199,1.1902563588732602,1.31047225115384,1.3983000000000001,1.4220445483121,1.4761]
["2012-05-24",1.1465848733240198,1.1523177976427799,1.1880396493242902,1.30803165394036,1.3956999999999999,1.4193961610921499,1.4733000000000001]
["2012-06-24",1.1445581103150999,1.1502809008188999,1.18593960869895,1.3057195092118001,1.3932,1.41688716267325,1.4706999999999999]
["2012-07-24",1.1425313473061798,1.1482440039950199,1.18383956807361,1.30340736448324,1.3907,1.4143781642543498,1.4681]
["2012-08-24",1.1403919863523198,1.1460939462364799,1.18162285852464,1.30096676726976,1.3880999999999999,1.4117297770343999,1.4654]
["2012-09-24",1.1383652233433998,1.1440570494125999,1.1795228178993,1.2986546225411999,1.3856999999999999,1.4092207786154998,1.4628000000000001]
["2012-10-24",1.1363384603344802,1.1420201525887199,1.1774227772739603,1.2963424778126402,1.3832,1.4067117801966,1.4601999999999999]
["2012-11-24",1.1341990993806201,1.1398700948301801,1.1752060677249903,1.2939018805991602,1.3806,1.4040633929766502,1.4574]
["2012-12-24",1.1321723363717,1.1378331980062999,1.1731060270996501,1.2915897358706001,1.3781000000000001,1.40155439455775,1.4548000000000001]
["2013-01-24",1.1301455733627799,1.1357963011824199,1.1710059864743101,1.2892775911420402,1.3756999999999999,1.39904539613885,1.4521999999999999]
["2013-02-24",1.1280062124089201,1.1336462434238799,1.1687892769253401,1.2868369939285602,1.3731,1.3963970089189,1.4495]
["2013-03-24",1.1259794494090998,1.1316093466392001,1.1666892363464001,1.2845248492140999,1.3706,1.3938880105279998,1.4469000000000001]
["2013-04-23",1.12356741942984,1.1291852565100799,1.16418999942336,1.2817731893618398,1.3676999999999999,1.3909020771072,1.4438]
["2013-05-23",1.12104575172425,1.1266509804660001,1.161577160822,1.27889645406175,1.3646,1.3877804194400001,1.4404999999999999]
["2013-06-23",1.11863372174499,1.1242268903368802,1.1590779238989601,1.2761447942094899,1.3615999999999999,1.3847944860192001,1.4374]
["2013-07-23",1.1161120540394001,1.1216926142928001,1.1564650852976002,1.2732680589094001,1.3586,1.3816728283520001,1.4341999999999999]
["2013-08-23",1.11370002406014,1.1192685241636802,1.1539658483745601,1.27051639905714,1.3555999999999999,1.3786868949312001,1.4311]
["2013-09-23",1.1111783563545501,1.1167342481196001,1.1513530097732001,1.26763966375705,1.3526,1.3755652372640002,1.4278]
["2013-10-23",1.10876632637529,1.1143101579904802,1.1488537728501602,1.2648880039047901,1.3495999999999999,1.3725793038432001,1.4247000000000001]
["2013-11-23",1.1062446586696999,1.1117758819463999,1.1462409342488,1.2620112686046998,1.3466,1.369457646176,1.4215]
["2013-12-23",1.1038326286904399,1.1093517918172799,1.1437416973257599,1.2592596087524399,1.3435999999999999,1.3664717127552,1.4184000000000001]
["2014-01-23",1.1013109609848499,1.1068175157732001,1.1411288587244,1.2563828734523499,1.3406,1.363350055088,1.4152]
["2014-02-23",1.0988989310055899,1.1043934256440802,1.1386296218013601,1.25363121360009,1.3375999999999999,1.3603641216672,1.4120999999999999]
["2014-03-23",1.0963772633088,1.1018591496132,1.1360167832420001,1.25075447827,1.3346,1.3572424639576002,1.4088000000000001]
["2014-04-22",1.0952938865663999,1.1007703559870998,1.1348942370135,1.2495185548724999,1.3331999999999999,1.3559013152777999,1.4074]
["2014-05-22",1.094210509824,1.0996815623609999,1.1337716907850002,1.248282631475,1.3319000000000001,1.354560166598,1.4059999999999999]
["2014-06-22",1.0931271330815999,1.0985927687348997,1.1326491445564999,1.2470467080774998,1.3306,1.3532190179182,1.4046000000000001]
["2014-07-22",1.0920437563392,1.0975039751088,1.1315265983280001,1.2458107846799999,1.3292999999999999,1.3518778692384001,1.4032]
["2014-08-22",1.0909603795967999,1.0964151814826999,1.1304040520995,1.2445748612824998,1.3280000000000001,1.3505367205585999,1.4018999999999999]
["2014-09-22",1.0898770028544,1.0953263878566,1.1292815058710002,1.2433389378849999,1.3266,1.3491955718788,1.4005000000000001]
["2014-10-22",1.0887936261119999,1.0942375942304998,1.1281589596424999,1.2421030144874998,1.3252999999999999,1.347854423199,1.3991]
["2014-11-22",1.0877102493696,1.0931488006043999,1.1270364134140001,1.2408670910899999,1.3240000000000001,1.3465132745192001,1.3976999999999999]
["2014-12-22",1.0866268726271999,1.0920600069782997,1.1259138671855,1.2396311676924998,1.3227,1.3451721258393998,1.3963000000000001]
["2015-01-22",1.0855434958848,1.0909712133522,1.1247913209570002,1.2383952442949999,1.3213999999999999,1.3438309771596,1.3949]
["2015-02-22",1.0844601191423999,1.0898824197260999,1.1236687747284999,1.2371593208974998,1.32,1.3424898284797999,1.3935]
["2015-03-22",1.0833767424,1.0887936261,1.1225462285000001,1.2359233974999999,1.3187,1.3411486798000001,1.3920999999999999]
["2015-04-27",1.0833767424,1.0887936261,1.1225462285000001,1.2359233974999999,1.3187,1.3411486798000001,1.3920999999999999]
["2015-05-27",1.0833767424,1.0887936261,1.1225462285000001,1.2359233974999999,1.3187,1.3411486798000001,1.3920999999999999]
["2015-06-27",1.0833767424,1.0887936261,1.1225462285000001,1.2359233974999999,1.3187,1.3411486798000001,1.3920999999999999]
["2015-07-27",1.0833767424,1.0887936261,1.1225462285000001,1.2359233974999999,1.3187,1.3411486798000001,1.3920999999999999]
["2015-08-27",1.0833767424,1.0887936261,1.1225462285000001,1.2359233974999999,1.3187,1.3411486798000001,1.3920999999999999]
["2015-09-27",1.0833767424,1.0887936261,1.1225462285000001,1.2359233974999999,1.3187,1.3411486798000001,1.3920999999999999]
["2015-10-27",1.0833767424,1.0887936261,1.1225462285000001,1.2359233974999999,1.3187,1.3411486798000001,1.3920999999999999]
["2015-11-27",1.0833767424,1.0887936261,1.1225462285000001,1.2359233974999999,1.3187,1.3411486798000001,1.3920999999999999]
["2015-12-27",1.0833767424,1.0887936261,1.1225462285000001,1.2359233974999999,1.3187,1.3411486798000001,1.3920999999999999]
["2016-01-27",1.0833767424,1.0887936261,1.1225462285000001,1.2359233974999999,1.3187,1.3411486798000001,1.3920999999999999]
["2016-02-27",1.0833767424,1.0887936261,1.1225462285000001,1.2359233974999999,1.3187,1.3411486798000001,1.3920999999999999]
["2016-03-27",1.0833767424,1.0887936261119999,1.122546228494,1.2359233975219999,1.3187,1.3411486798000001,1.3920999999999999]
["2016-04-26",1.0825186222080001,1.0879312153190399,1.12165708296648,1.2349444482962399,1.3177000000000001,1.3400863838160002,1.391]
["2016-05-26",1.081553236992,1.0869610031769599,1.1206567942480199,1.2338431304172599,1.3165,1.338891300834,1.3897999999999999]
["2016-06-26",1.0806951168000001,1.0860985923839999,1.1197676487205002,1.2328641811915,1.3154999999999999,1.3378290048500001,1.3887]
["2016-07-26",1.0798369966079999,1.0852361815910399,1.11887850319298,1.2318852319657398,1.3144,1.336766708866,1.3875999999999999]
["2016-08-26",1.0788716113920001,1.08426596944896,1.1178782144745201,1.23078391408676,1.3131999999999999,1.335571625884,1.3863000000000001]
["2016-09-26",1.0780134911999999,1.0834035586559998,1.1169890689469999,1.2298049648609997,1.3122,1.3345093298999999,1.3852]
["2016-10-26",1.077155371008,1.0825411478630398,1.1160999234194799,1.22882601563524,1.3111999999999999,1.3334470339160001,1.3841000000000001]
["2016-11-26",1.0761899857920001,1.08157093572096,1.11509963470102,1.2277246977562599,1.31,1.3322519509340001,1.3829]
["2016-12-26",1.0753318655999999,1.0807085249279997,1.1142104891735001,1.2267457485304998,1.3089,1.33118965495,1.3817999999999999]
["2017-01-26",1.074473745408,1.0798461141350399,1.1133213436459801,1.2257667993047399,1.3079000000000001,1.3301273589660001,1.3807]
["2017-02-26",1.0735083601919999,1.0788759019929599,1.11232105492752,1.2246654814257598,1.3067,1.3289322759839999,1.3794]
["2017-03-26",1.07265024,1.0780134912000001,1.1114319093860001,1.2236865322070001,1.3057000000000001,1.3278699799589999,1.3783000000000001]
["2017-04-25",1.0700467199999999,1.0753969536000001,1.1087342591205001,1.2207164192647502,1.3025,1.32464699457075,1.375]
["2017-05-25",1.0674431999999998,1.0727804160000001,1.106036608855,1.2177463063224998,1.2992999999999999,1.3214240091824998,1.3715999999999999]
["2017-06-25",1.06483968,1.0701638784,1.1033389585894999,1.2147761933802499,1.2962,1.3182010237942499,1.3683000000000001]
["2017-07-25",1.0622361599999999,1.0675473408,1.1006413083240001,1.211806080438,1.2929999999999999,1.3149780384059999,1.3649]
["2017-08-25",1.05963264,1.0649308032000002,1.0979436580585,1.2088359674957501,1.2898000000000001,1.31175505301775,1.3615999999999999]
["2017-09-25",1.0570291199999997,1.0623142656,1.095246007793,1.2058658545534999,1.2867,1.3085320676294998,1.3583000000000001]
["2017-10-25",1.0544255999999999,1.0596977279999999,1.0925483575274999,1.20289574161125,1.2835000000000001,1.3053090822412499,1.3549]
["2017-11-25",1.05182208,1.0570811904000001,1.0898507072620001,1.1999256286690001,1.2803,1.3020860968529999,1.3515999999999999]
["2017-12-25",1.0492185599999999,1.0544646528000001,1.0871530569965,1.19695551572675,1.2771999999999999,1.29886311146475,1.3482000000000001]
["2018-01-25",1.0466150399999998,1.0518481151999999,1.0844554067309999,1.1939854027844998,1.274,1.2956401260764998,1.3449]
["2018-02-25",1.0440115199999997,1.0492315776000001,1.0817577564654999,1.1910152898422499,1.2707999999999999,1.2924171406882499,1.3414999999999999]
["2018-03-25",1.0414079999999999,1.0466150399999998,1.07906010624,1.1880451769344,1.2676000000000001,1.2891941553152002,1.3382000000000001]
["2018-04-24",1.039374,1.0445708699999998,1.0769525669700002,1.1857247761981999,1.2652000000000001,1.2866761979806001,1.3355999999999999]
["2018-05-24",1.0373399999999999,1.0425267,1.0748450277000001,1.1834043754620001,1.2626999999999999,1.2841582406460001,1.333]
["2018-06-24",1.0353059999999998,1.04048253,1.0727374884300001,1.1810839747258,1.2602,1.2816402833114,1.3303]
["2018-07-24",1.033272,1.03843836,1.0706299491600002,1.1787635739895999,1.2577,1.2791223259768001,1.3277000000000001]
["2018-08-24",1.0312379999999999,1.03639419,1.0685224098900001,1.1764431732534,1.2553000000000001,1.2766043686422002,1.3250999999999999]
["2018-09-24",1.029204,1.03435002,1.0664148706200001,1.1741227725171999,1.2527999999999999,1.2740864113076,1.3225]
["2018-10-24",1.0271699999999999,1.03230585,1.06430733135,1.171802371781,1.2503,1.2715684539730001,1.3199000000000001]
["2018-11-24",1.0251359999999998,1.03026168,1.0621997920800001,1.1694819710447999,1.2478,1.2690504966384002,1.3172999999999999]
["2018-12-24",1.023102,1.0282175099999999,1.0600922528100001,1.1671615703086,1.2454000000000001,1.2665325393038001,1.3147]
["2019-01-24",1.0210679999999999,1.0261733399999999,1.05798471354,1.1648411695723999,1.2428999999999999,1.2640145819692001,1.3120000000000001]
["2019-02-24",1.019034,1.0241291699999999,1.0558771742700002,1.1625207688362,1.2403999999999999,1.2614966246346,1.3093999999999999]
["2019-03-24",1.0169999999999999,1.0220849999999997,1.0537696349999999,1.1602003681349999,1.2379,1.2589786672776,1.3068]
["2019-04-22",1.0156000000000001,1.020678,1.0523190179999999,1.1586032388180001,1.2362,1.2572455599676802,1.3049999999999999]
["2019-05-22",1.0142,1.0192709999999998,1.050868401,1.157006109501,1.2344999999999999,1.2555124526577601,1.3031999999999999]
["2019-06-22",1.0127999999999999,1.0178639999999999,1.0494177839999999,1.155408980184,1.2327999999999999,1.2537793453478399,1.3013999999999999]
["2019-07-22",1.0113000000000001,1.0163564999999999,1.0478635515000001,1.1536977702015001,1.2310000000000001,1.2519224446586401,1.2995000000000001]
["2019-08-22",1.0099,1.0149494999999999,1.0464129344999999,1.1521006408845,1.2293000000000001,1.2501893373487201,1.2977000000000001]
["2019-09-22",1.0085,1.0135424999999998,1.0449623174999998,1.1505035115675,1.2276,1.2484562300388,1.2959000000000001]
["2019-10-22",1.0071000000000001,1.0121355000000001,1.0435117005000001,1.1489063822505001,1.2259,1.2467231227288802,1.2941]
["2019-11-22",1.0057,1.0107284999999999,1.0420610834999999,1.1473092529335001,1.2242,1.2449900154189601,1.2923]
["2019-12-22",1.0043,1.0093214999999998,1.0406104665,1.1457121236165,1.2224999999999999,1.2432569081090401,1.2905]
["2020-01-22",1.0027999999999999,1.0078139999999998,1.0390562339999998,1.1440009136339999,1.2205999999999999,1.2414000074198399,1.2886]
["2020-02-22",1.0014000000000001,1.0064070000000001,1.0376056170000001,1.1424037843170001,1.2189000000000001,1.2396669001099201,1.2867999999999999]
["2020-03-22",1,1.0049999999999999,1.0361549999999997,1.1408066549999998,1.2172000000000001,1.2379337927909999,1.2849999999999999]
["2020-04-28",1,1.0045999999999999,1.0357425999999998,1.1403526025999997,1.2168000000000001,1.2374410828237199,1.2845]
["2020-05-28",1,1.0042,1.0353302,1.1398985501999999,1.2162999999999999,1.2369483728564399,1.284]
["2020-06-28",1,1.0038,1.0349177999999999,1.1394444978,1.2158,1.2364556628891601,1.2834000000000001]
["2020-07-28",1,1.0033000000000001,1.0344023,1.1388769323000001,1.2152000000000001,1.2358397754300601,1.2827999999999999]
["2020-08-28",1,1.0028999999999999,1.0339898999999999,1.1384228798999998,1.2146999999999999,1.2353470654627798,1.2823]
["2020-09-28",1,1.0024999999999999,1.0335774999999998,1.1379688274999997,1.2141999999999999,1.2348543554954998,1.2818000000000001]
["2020-10-28",1,1.0021,1.0331650999999999,1.1375147750999999,1.2137,1.23436164552822,1.2813000000000001]
["2020-11-28",1,1.0017,1.0327526999999999,1.1370607227,1.2132000000000001,1.23386893556094,1.2807999999999999]
["2020-12-28",1,1.0013000000000001,1.0323403,1.1366066703,1.2128000000000001,1.23337622559366,1.2802]
["2021-01-28",1,1.0007999999999999,1.0318247999999999,1.1360391047999998,1.2121999999999999,1.2327603381345598,1.2796000000000001]
["2021-02-28",1,1.0004,1.0314123999999998,1.1355850523999997,1.2117,1.23226762816728,1.2790999999999999]
["2021-03-28",1,1,1.0309999999999999,1.1351309999999999,1.2112000000000001,1.2317749182089999,1.2786]
["2021-04-27",1,1,1.0284,1.1322684000000001,1.2081,1.2286685993075999,1.2754000000000001]
["2021-05-27",1,1,1.0258,1.1294058,1.2051000000000001,1.2255622804062001,1.2721]
["2021-06-27",1,1,1.0233000000000001,1.1266533000000001,1.2020999999999999,1.2225754353087002,1.2689999999999999]
["2021-07-27",1,1,1.0206999999999999,1.1237906999999998,1.1991000000000001,1.2194691164072999,1.2658]
["2021-08-27",1,1,1.0181,1.1209281,1.196,1.2163627975058999,1.2625999999999999]
["2021-09-27",1,1,1.0155000000000001,1.1180655000000002,1.1930000000000001,1.2132564786045001,1.2594000000000001]
["2021-10-27",1,1,1.0128999999999999,1.1152028999999999,1.1899,1.2101501597030999,1.2561]
["2021-11-27",1,1,1.0103,1.1123403000000001,1.1869000000000001,1.2070438408016999,1.2528999999999999]
["2021-12-27",1,1,1.0078,1.1095877999999999,1.1839,1.2040569957042,1.2498]
["2022-01-27",1,1,1.0052000000000001,1.1067252000000001,1.1809000000000001,1.2009506768028,1.2465999999999999]
["2022-02-27",1,1,1.0025999999999999,1.1038625999999998,1.1778,1.1978443579014,1.2434000000000001]
["2022-03-27",1,1,1,1.101,1.1748000000000001,1.194738039,1.2401]
["2022-04-26",1,1,1,1.0926,1.1657999999999999,1.1856228714000001,1.2306999999999999]
["2022-05-26",1,1,1,1.0842000000000001,1.1568000000000001,1.1765077038000002,1.2212000000000001]
["2022-06-26",1,1,1,1.0758000000000001,1.1478999999999999,1.1673925362000002,1.2118]
["2022-07-26",1,1,1,1.0672999999999999,1.1388,1.1581688547,1.2021999999999999]
["2022-08-26",1,1,1,1.0589,1.1297999999999999,1.1490536871000001,1.1927000000000001]
["2022-09-26",1,1,1,1.0505,1.1209,1.1399385195,1.1833]
["2022-10-26",1,1,1,1.0421,1.1119000000000001,1.1308233519000002,1.1738]
["2022-11-26",1,1,1,1.0337000000000001,1.103,1.1217081843000001,1.1642999999999999]
["2022-12-26",1,1,1,1.0253000000000001,1.0940000000000001,1.1125930167000002,1.1549]
["2023-01-26",1,1,1,1.0167999999999999,1.0849,1.1033693352,1.1453]
["2023-02-26",1,1,1,1.0084,1.0760000000000001,1.0942541675999999,1.1357999999999999]
["2023-03-26",1,1,1,1,1.0669999999999999,1.0851389999999999,1.1264000000000001]
["2023-04-24",1,1,1,1,1.0613999999999999,1.0794437999999997,1.1205000000000001]
["2023-05-24",1,1,1,1,1.0558000000000001,1.0737486000000001,1.1146]
["2023-06-24",1,1,1,1,1.0503,1.0681550999999998,1.1087]
["2023-07-24",1,1,1,1,1.0447,1.0624598999999999,1.1028]
["2023-08-24",1,1,1,1,1.0390999999999999,1.0567646999999998,1.0969]
["2023-09-24",1,1,1,1,1.0335000000000001,1.0510694999999999,1.091]
["2023-10-24",1,1,1,1,1.0279,1.0453743,1.0851]
["2023-11-24",1,1,1,1,1.0223,1.0396790999999999,1.0791999999999999]
["2023-12-24",1,1,1,1,1.0167999999999999,1.0340855999999998,1.0733999999999999]
["2024-01-24",1,1,1,1,1.0112000000000001,1.0283903999999999,1.0674999999999999]
["2024-02-24",1,1,1,1,1.0056,1.0226952,1.0616000000000001]
["2024-03-24",1,1,1,1,1,1.0169999999999999,1.0556000000000001]
["2024-04-23",1,1,1,1,1,1.0156000000000001,1.0542]
["2024-05-23",1,1,1,1,1,1.0142,1.0527]
["2024-06-23",1,1,1,1,1,1.0127999999999999,1.0512999999999999]
["2024-07-23",1,1,1,1,1,1.0113000000000001,1.0497000000000001]
["2024-08-23",1,1,1,1,1,1.0099,1.0483]
["2024-09-23",1,1,1,1,1,1.0085,1.0468]
["2024-10-23",1,1,1,1,1,1.0071000000000001,1.0454000000000001]
["2024-11-23",1,1,1,1,1,1.0057,1.0439000000000001]
["2024-12-23",1,1,1,1,1,1.0043,1.0425]
["2025-01-23",1,1,1,1,1,1.0027999999999999,1.0408999999999999]
["2025-02-23",1,1,1,1,1,1.0014000000000001,1.0395000000000001]
["2025-03-23",1,1,1,1,1,1,1.038]
["2025-04-22",1,1,1,1,1,1,1.0347999999999999]
["2025-05-22",1,1,1,1,1,1,1.0317000000000001]
["2025-06-22",1,1,1,1,1,1,1.0285]
["2025-07-22",1,1,1,1,1,1,1.0253000000000001]
["2025-08-22",1,1,1,1,1,1,1.0222]
["2025-09-22",1,1,1,1,1,1,1.0189999999999999]
["2025-10-22",1,1,1,1,1,1,1.0158]
["2025-11-22",1,1,1,1,1,1,1.0126999999999999]
["2025-12-22",1,1,1,1,1,1,1.0095000000000001]
["2026-01-22",1,1,1,1,1,1,1.0063]
["2026-02-22",1,1,1,1,1,1,1.0032000000000001]
["2026-03-22",1,1,1,1,1,1,1]

{"sheet":"Contents","index":3,"n_rows":35,"n_cols":5,"rows_kept":35,"cut":false,"hidden":true,"merged":[[34,1,35,17],[3,1,5,3],[3,4,5,17],[6,1,25,17],[28,1,29,17],[30,1,33,17]]}
[]
[]
[]
[null,null,null,null,"NHS Superannuation Scheme (Scotland) Preserved Benefits Estimate Calculator"]
[]
[]
[]
[]
[]
[]
[]
[]
[]
[]
[]
[]
[]
[]
[]
[]
[]
[]
[]
[]
[]
[]
[]
[]
[null,"Disclaimer"]
[]
[null,"Please note that the illustration is not a guarantee or a statement of your legal entitlement.  The calculator is NOT intended to provide you with financial advice.  If you require financial advice, you should contact an independent financial advisor."]
[]
[]
[]
[null,"Please refer to the SPPA website for contact information or any other details of benefits available through the NHS Superannuation Scheme (Scotland)."]

{"sheet":"Guidance Notes","index":4,"n_rows":48,"n_cols":2,"rows_kept":48,"cut":false,"hidden":true,"merged":[[0,1,2,14],[42,1,45,14],[46,1,46,14],[47,1,49,14],[40,1,41,14],[4,1,37,14]]}
[null,"Guidance Notes"]
[]
[]
[]
[null,"Understanding your results\n\nThis calculator is solely for guidance purposes and is an estimate only.  It is not a statement of your legal entitlement and is not intended to provide you with financial advice.  While every care has been taken in the preparation of this calculator the Scottish Public Pensions Agency will accept no responsibility for the accuracy of the information it provides.  If you require financial advice, you should contact an authorised independent financial adviser.  \n\nAs you are no longer in pensionable employment, your basic retirement benefits should remain unchanged.  These will be index linked in line with inflation.  Please note, this calculator is only for 1995 or 2008 members.  \n\nYou should have received a preserved letter detailing the breakdown of your deferred retirement benefits.  You will need this information to allow you to project a current estimate of your benefits.  Please note that if your pension breakdown may not provide you with your deemed date which is used to calculate how much pension increase you may be entitled to.  If this is the case the calculator will assume this date is the day after your last day worked (final year).  If your pensionable salary used is your second or third last year this may underinflate the pension increase you are entitled to.  Alternatively you can contact the Agency and request your deemed date.\n\nIf your date of leaving is after 30 March 2000, you may claim your benefits prior to your Normal Pension Age (NPA) if you wish but this will be subject to a reduction as it will be paid early.  If you are aged 55 or over the calculator will allow you to estimate your retirement benefits to include the VERA reduction.  If you simply wish to have a current estimate of your deferred benefits please state \"No\" when prompted.\n\nTo calculate your estimated benefits, you need to complete the necessary information under \"Member Details\".  Once  you have completed all the relevant information your estimated benefits will be shown on the \"Benefit Certificate\" and \"Letter\".  If you do not complete all of the necessary information your estimate will not work.  \n\nEach page allows you to go back to previous stages if you wish by simply clicking on the relevant box to where you wish to go.\n\nPractitioners\n\nIf you are a Practitioner, please use the \"Practitioners Member Details\" as your preserved benefits are calculated differently.    Once  you have completed all the relevant information your estimated benefits will be shown on the \"Practitioners Benefit Certificate\" and \"Practitioners Letter\".  If you do not complete all of the necessary information your estimate will not work.  "]
[]
[]
[]
[]
[]
[]
[]
[]
[]
[]
[]
[]
[]
[]
[]
[]
[]
[]
[]
[]
[]
[]
[]
[]
[]
[]
[]
[]
[]
[]
[]
[]
[]
[]
[]
[null,"Disclaimer"]
[]
[null,"This calculator is intended for illustrative purposes only. This is not a statement of your legal entitlement.  While every care has been taken in the preparation of this ready reckoner the Scottish Public Pensions Agency will accept no responsibility for the accuracy of the information it provides."]
[]
[]
[]
[]
[null,"Please refer to the SPPA website for contact information or any other details of benefits available through the NHS Superannuation Scheme (Scotland)."]

{"sheet":"Member Details","index":5,"n_rows":38,"n_cols":21,"rows_kept":38,"cut":false,"hidden":false,"merged":[[24,16,24,17],[24,14,24,15],[17,2,17,4],[22,10,22,13],[20,10,20,11],[24,10,24,13],[20,12,20,13],[22,6,22,9],[1,2,3,4],[8,2,8,4],[9,2,9,4],[14,2,14,4],[15,2,15,4],[37,8,37,9],[37,10,37,13],[17,8,17,9],[17,10,17,13],[20,7,20,9],[34,8,34,9],[35,8,35,9],[31,10,31,13],[32,10,32,13],[33,10,33,13],[34,10,34,13],[35,10,35,13],[31,8,31,9],[32,8,32,9],[33,8,33,9],[29,8,29,15],[1,5,3,18],[11,8,11,9],[11,10,11,13],[19,10,19,11],[19,12,19,13],[5,9,5,14],[13,8,13,9],[13,10,13,13],[7,12,7,13],[9,10,9,13],[15,10,15,13],[7,8,7,9],[9,7,9,9],[15,7,15,9]]}
[]
[null,null,null,null,null,"NHS Superannuation Scheme (Scotland) Preserved Benefits Estimate Calculator"]
[]
[]
[]
[null,null,null,null,"Member Details",null,null,null,null,"PLEASE COMPLETE ALL NECESSARY DATA"]
[]
[null,null,null,null,null,null,null,null,"Members Name  ",null,null,null,null,null,null,"Eg: Mr | J | Smith"]
[]
[null,null,null,null,null,null,null,"Superannuation Number  "]
[]
[null,null,null,null,null,null,null,null,"Date of Birth  ",null,null,null,null,null,null,null,null,null,null,{"$f":"DATEDIF(K12,NOW(),\"Y\")","v":126},"Yes"]
[null,null,null,null,null,null,null,null,null,null,null,null,null,null,null,null,null,null,null,null,"No"]
[null,null,null,null,null,null,null,null,"Scheme  ",null,null,null,null,null,null,null,null,null,1995]
[null,null,null,null,null,null,null,null,null,null,null,null,null,null,null,null,null,null,2008]
[null,null," ",null,null,null,null,"Last Day Worked in NHS ",null,null,null,null,null,null,null,null,{"$f":"IF(R16>=S16,\"VERA\",\"AGE\")","v":"AGE"},{"$f":"K16","v":0},36616]
[]
[null,null," ",null,null,null,null,null,"Pensionable Salary  "]
[]
[null,null,null,null,null,null,null,null,null,null,"Years",null,"Days"]
[null,null,null,null,null,null,null,"Total Reckonable Service  "]
[]
[null,null,null,null,null,null,"Deemed Date for Pension Increase  ",null,null,null,null,null,null,null,null,null,null,null,{"$f":"IF(K23=\"\",K16+1,\"\")","v":"1900-01-01"}]
[]
[null,null,null,null,null,null,null,null,null,{"$f":"IF(T12>=55,\"Are you looking for a Retirement Estimate?  \",\"\")","v":"Are you looking for a Retirement Estimate?  "},null,null,null,null,{"$f":"IF(K25=\"Yes\",\"Retirement Date  \",\"\")","v":""},null,null,null,"Yes"]
[null,null,null,null,null,null,null,null,null,null,null,null,null,null,null,null,null,null,"No"]
[]
[]
[]
[null,null,null,null,null,null,null,null,"Additional Information if Letter and Certificate Required"]
[]
[null,null,null,null,null,null,null,null,"Address Line 1  "]
[null,null,null,null,null,null,null,null,"Address Line 2  "]
[null,null,null,null,null,null,null,null,"Address Line 3  "]
[null,null,null,null,null,null,null,null,"Address Line 4  "]
[null,null,null,null,null,null,null,null,"Post Code  "]
[]
[null,null,null,null,null,null,null,null,"NI Number  "]

{"sheet":"Age","index":6,"n_rows":20,"n_cols":27,"rows_kept":20,"cut":false,"hidden":true,"merged":[]}
[]
[]
[null,null,"Period Calculator V 1.3"]
[null,null,null,null,null,null,null,null,null,null,null,null,null,null,null,null,1,365,31,31]
[null,null,null,null,null,null,null,null,null,null,null,null,null,null,null,null,2,334,59,28]
[null,null,null,"dd","mm","yyyy",null,null,null,null,null,null,null,null,null,null,3,306,90,31]
[null,null,"Date From :",{"$f":"DAY(M15)","v":0},{"$f":"MONTH(M15)","v":1},{"$f":"YEAR(M15)","v":1900},{"$f":"IF(AA9>0,AA9,0)","v":46070},"Days",null,null,null,null,null,null,null,null,4,275,120,30,{"$f":"D7","v":0},{"$f":"IF(E7>0,VLOOKUP($E$7,Table50,2),0)","v":365},{"$f":"F7","v":1900},{"$f":"IF(E7>0,VLOOKUP($E$7,Table50,4),0)","v":31},{"$f":"(V7+1)-U7","v":366},{"$f":"(W7*365)-Y7","v":693134},{"$f":"Y7+Z7","v":693500}]
[null,null,"Date To :",{"$f":"DAY(M16)","v":20},{"$f":"MONTH(M16)","v":3},{"$f":"YEAR(M16)","v":2026},{"$f":"IF(G7>0,G7/365,0)","v":126.21917808219177},"Years",{"$f":"((F8-F7)*12)+(E8-E7)","v":1514},"Months",null,null,null,null,null,null,5,245,151,31,{"$f":"D8","v":20},{"$f":"IF(E8>0,VLOOKUP($E$8,Table50,3),0)","v":90},{"$f":"F8","v":2026},{"$f":"IF(E8>0,VLOOKUP($E$8,Table50,4),0)","v":31},{"$f":"(V8-X8)+U8","v":79},{"$f":"((W8*365)-365)+Y8","v":739204},{"$f":"Z8+Y7","v":739570}]
[null,null,null,null,null,"                                                                                                                                                                                                                                                                                                                                                                                                                    ",null,null,null,null,null,null,null,null,null,null,6,214,181,30,null,null,null,null,null,null,{"$f":"AA8-AA7","v":46070}]
[null,null,"Duration :",{"$f":"TRUNC(G8)","v":126},"Years",{"$f":"(G8-D10)*365","v":79.999999999997726},"Days",null,null,null,null,null,null,null,null,null,7,184,212,31]
[null,null,null,null,null,null,null,null,null,null,null,null,null,null,null,null,8,153,243,31]
[null,null,null,null,null,null,null,null,null,null,null,null,null,null,null,null,9,122,273,30]
[null,null,"Approximation :",{"$f":"D10","v":126},"Years",{"$f":"DATEDIF(M15,M16,\"YM\")","v":2},"Months",null,null,null,null,null,null,null,null,null,10,92,304,31]
[null,null,null,null,null,null,null,null,null,null,null,null,null,null,null,null,11,61,334,30]
[null,null,null,null,null,null,null,null,null,null,null,null,{"$f":"IF(AND('Member Details'!K12=\"\",'Practitioners Member Details'!K12<>\"\"),'Practitioners Member Details'!K12,'Member Details'!K12)","v":"00:00:00"},null,null,null,12,31,365,31]
[null,null,null,null,null,null,null,null,null,null,null,null,{"$f":"IF('Member Details'!Q25<>\"\",'Member Details'!Q25,IF('Practitioners Member Details'!Q22<>\"\",'Practitioners Member Details'!Q22,NOW()))","v":"2026-03-20T08:00:15.720"}]
[]
[null,null,null,null,null,null,null,null,null,null,null,"Year",{"$f":"DATEDIF(M15,M16,\"Y\")","v":126}]
[null,null,null,null,null,null,null,null,null,null,null,"Months",{"$f":"DATEDIF(M15,M16,\"YM\")","v":2}]
[null,null,null,null,null,null,null,null,null,null,null,"Days",{"$f":"DATEDIF(M15,M16,\"MD\")","v":20}]

{"sheet":"PI Finder","index":7,"n_rows":9,"n_cols":7,"rows_kept":9,"cut":false,"hidden":true,"merged":[]}
[]
[null,null,null,null,null,"yyyy","PI Date"]
[null,null,"Select PI table:",null,null,{"$f":"IF(AND('Member Details'!K25=\"Yes\",'Member Details'!Q25<G3),2025,2026)","v":2026},"2026-04-06"]
[]
[null,null,null,null,null,"dd/mm/yyyy"]
[null,null,"Enter date for PI:",null,null,{"$f":"IF('Member Details'!K23=\"\",'Member Details'!S23,'Member Details'!K23)","v":"1900-01-01"}]
[]
[]
[null,null,"PI for this date is:",null,null,{"$f":"IF(F6=0/1/1900,1,VLOOKUP(F6,'PI Data'!$A$3:$AZ$998,F3 - 'PI Data'!$A$1 + 2))","v":{"$error":"#N/A"}}]

{"sheet":"Benefit Certificate","index":8,"n_rows":43,"n_cols":11,"rows_kept":43,"cut":false,"hidden":true,"merged":[[42,0,42,2],[42,3,42,4],[39,0,39,2],[39,3,39,4],[40,0,40,2],[40,3,40,4],[41,0,41,2],[41,3,41,4],[36,0,36,4],[37,0,37,2],[37,3,37,4],[38,0,38,2],[38,3,38,4],[15,0,15,1],[15,3,15,4],[26,0,26,1],[26,3,26,4],[17,0,17,4],[18,0,18,2],[18,3,18,4],[20,0,20,2],[20,3,20,4],[21,0,21,1],[22,0,22,1],[22,2,22,3],[24,0,24,2],[24,3,24,4],[23,0,23,4],[25,0,25,4],[11,0,11,1],[11,2,11,3],[12,0,12,1],[13,0,13,1],[13,3,13,4],[10,0,10,1],[10,2,10,3],[0,0,0,4],[1,0,1,4],[2,0,2,4],[3,0,3,4],[4,2,4,3],[5,2,5,3],[6,0,6,4],[7,0,7,2],[7,3,7,4],[9,0,9,2],[9,3,9,4],[35,0,35,2],[35,3,35,4],[28,0,28,4],[32,0,32,2],[32,3,32,4],[33,0,33,2],[33,3,33,4],[34,0,34,2],[34,3,34,4],[29,0,29,2],[29,3,29,4],[30,0,30,2],[30,3,30,4],[31,0,31,2],[31,3,31,4]]}
[{"$f":"IF('Member Details'!K14=1995,\"NHS 1995 Section\",\"NHS 2008 Section\")","v":"NHS 2008 Section"}]
["Estimated Retirement Benefits from Deferred Status"]
[{"$f":"IF(AND('Member Details'!Q16=\"VERA\",Age!M18<60,'Member Details'!K25=\"Yes\"),\"with Actuarial Reduced Pension\",\"\")","v":""}]
[{"$f":"IF('Member Details'!Q25<>\"\",'Member Details'!Q25,NOW())","v":"2026-03-20T08:00:15.720"}]
["Name:",{"$f":"'Member Details'!K8&\" \"&'Member Details'!L8&\" \"&'Member Details'!M8","v":"  "},"Last day of Service:",null,{"$f":"'Member Details'!K16","v":"00:00:00"}]
["NI Number:",{"$f":"'Member Details'!K38","v":0},"Reference:",null,{"$f":"'Member Details'!K10","v":0}]
["Annual Pension",null,null,null,null,null,null,null,45110]
["Pensionable Service",null,null,null,null,null,null,null,43402]
[]
[{"$f":"IF('Member Details'!K14=1995,'Member Details'!K21&\" Years \"& 'Member Details'!M21&\" Days x 1/80th of £\"&'Member Details'!K18,'Member Details'!K21&\" Years \"& 'Member Details'!M21&\" Days x 1/60th of £\"&'Member Details'!K18)","v":" Years  Days x 1/60th of £"},null,null,{"$f":"IF('Member Details'!K14=1995,(('Member Details'!M21/365)+'Member Details'!K21)*'Member Details'!K18/80,(('Member Details'!M21/365)+'Member Details'!K21)*'Member Details'!K18/60)","v":0}]
[null,null,null,null,null,null,null,null,"VERA 1995",null,"VERA 2008"]
[{"$f":"IF(AND('Member Details'!Q16=\"VERA\",Age!M18<60,'Member Details'!K25=\"Yes\"),\"Less early retirement reduction (\"&G12&\"%)\",\" \")","v":" "},null,{"$f":"IF(AND('Member Details'!Q16=\"VERA\",Age!M18<60,'Member Details'!K25=\"Yes\",'Member Details'!K14=1995),\"£\" & ROUND(D10,2) & \" x \" & I12,IF(AND('Member Details'!Q16=\"VERA\",Age!M18<65,'Member Details'!K25=\"Yes\",'Member Details'!K14=2008),\"£\" & ROUND(D10,2) & \" x \" & K12,\" \"))","v":" "},null,{"$f":"IF(AND('Member Details'!Q16=\"VERA\",Age!M18<60,'Member Details'!K25=\"Yes\",'Member Details'!K14=1995),D10*I12,IF(AND('Member Details'!Q16=\"VERA\",Age!M18<65,'Member Details'!K25=\"Yes\",'Member Details'!K14=2008),D10*K12,0))","v":0},{"$f":"IF(AND('Member Details'!K14=1995,I12<>\"\"),((1-I12)*100),IF(AND('Member Details'!K14=2008,K12<>\"\"),((1-K12)*100),\"\"))","v":""},{"$f":"IF(F12<>\"\",ROUND(F12,2),\"\")","v":""},null,{"$f":"IF(AND('Member Details'!Q16=\"VERA\",Age!M18<60,'Member Details'!K25=\"Yes\",'Member Details'!K14=1995),IF('Member Details'!Q25<45110,VLOOKUP(Age!M18,'VERA Pension Factors'!A7:M18,MATCH(Age!M19,'VERA Pension Factors'!A7:M7,0),FALSE),VLOOKUP(Age!M18,'VERA Pension Factors'!P7:AB18,MATCH(Age!M19,'VERA Pension Factors'!P7:AB7,0),FALSE)),\"\")","v":""},null,{"$f":"IF(AND('Member Details'!Q16=\"VERA\",Age!M18<65,'Member Details'!K25=\"Yes\",'Member Details'!K14=2008),IF('Member Details'!Q25<45110,VLOOKUP(Age!M18,'VERA Pension Factors'!A44:M53,MATCH(Age!M19,'VERA Pension Factors'!A36:M36,0),FALSE),VLOOKUP(Age!M18,'VERA Pension Factors'!P44:AB53,MATCH(Age!M19,'VERA Pension Factors'!P36:AB36,0),FALSE)),\"\")","v":""}]
[]
[{"$f":"IF('PI Finder'!F9>1,\"Plus Pension Increase\" &\" (\"&F14&\")\",\" \")","v":{"$error":"#N/A"}},null,null,{"$f":"IF('PI Finder'!F9>1,IF(E12<>0,(E12*F14)-E12,(D10*F14)-D10),0)","v":{"$error":"#N/A"}},null,{"$f":"IF('PI Finder'!F9>1,ROUND('PI Finder'!F9,4),0)","v":{"$error":"#N/A"}}]
[]
["Estimated Annual Pension",null,null,{"$f":"IF(AND('Member Details'!Q16=\"VERA\",Age!M18<60,'Member Details'!K25=\"Yes\"),SUM(E12+D14),SUM(D10+D14))","v":{"$error":"#N/A"}}]
[]
["Lump Sum"]
[{"$f":"IF('Member Details'!K14=1995,\"Pensionable Service\",\"\")","v":""}]
[]
[{"$f":"IF('Member Details'!K14=1995,'Member Details'!K21&\" Years \"& 'Member Details'!M21&\" Days x 3/80th of £\"&'Member Details'!K18,\"\")","v":""},null,null,{"$f":"IF('Member Details'!K14=1995,(('Member Details'!M21/365)+'Member Details'!K21)*'Member Details'!K18*3/80,0)","v":0}]
[{"$f":"IF('Member Details'!K14=2008,\"No Automatic Lump Sum given.\",\"\")","v":""},null,null,null,null,null,null,null,"VERA LS"]
[{"$f":"IF(AND('Member Details'!Q16=\"VERA\",Age!M18<60,'Member Details'!K25=\"Yes\",'Member Details'!K14=1995),\"Less early retirement reduction (\"&G23&\"%)\",\" \")","v":" "},null,{"$f":"IF(AND('Member Details'!Q16=\"VERA\",Age!M18<60,'Member Details'!K25=\"Yes\",'Member Details'!K14=1995),\"£\" & ROUND(D21,2) & \" x \" & I23,\" \")","v":" "},null,{"$f":"IF(AND('Member Details'!Q16=\"VERA\",Age!M18<60,'Member Details'!K25=\"Yes\",'Member Details'!K14=1995),ROUND('Benefit Certificate'!D21,2)*'Benefit Certificate'!I23,0)","v":0},{"$f":"IF(AND('Member Details'!Q16=\"VERA\",Age!M18<60,'Member Details'!K14=1995),(1-'Benefit Certificate'!I23)*100,\"\")","v":""},{"$f":"IF(F23<>\"\",ROUND(F23,2),\"\")","v":""},null,{"$f":"IF(AND('Member Details'!Q16=\"VERA\",Age!M18<60,'Member Details'!K25=\"Yes\",'Member Details'!K14=1995),IF('Member Details'!Q25<45110,VLOOKUP(Age!M18,'VERA LS Factors'!A7:M19,MATCH(Age!M19,'VERA LS Factors'!A7:M7,0),FALSE),VLOOKUP(Age!M18,'VERA LS Factors'!P7:AB19,MATCH(Age!M19,'VERA LS Factors'!P7:AB7,0),FALSE)),\"\")","v":""}]
[{"$f":"IF('Member Details'!K14=2008,\"You may wish to give up part of your pension to receive a tax free Lump Sum.\",\"\")","v":""}]
[{"$f":"IF(AND('PI Finder'!F9>1,'Member Details'!K14=1995),\"Plus Pension Increase\" &\" (\"&F25&\")\",\" \")","v":{"$error":"#N/A"}},null,null,{"$f":"IF(AND('PI Finder'!F9>1,'Member Details'!K14=1995),IF(E23<>0,(E23*F25)-E23,(D21*F25)-D21),0)","v":{"$error":"#N/A"}},null,{"$f":"IF(AND('PI Finder'!F9>1,'Member Details'!K14=1995),ROUND('PI Finder'!F9,4),0)","v":{"$error":"#N/A"}}]
[{"$f":"IF('Member Details'!K14=2008,\"The maximum allowed by HM Revenue & Customs is 25% of your Fund Value.\",\"\")","v":""}]
[{"$f":"IF('Member Details'!K14=1995,\"Estimated Lump Sum\",\"\")","v":""},null,null,{"$f":"IF(AND('Member Details'!Q16=\"VERA\",Age!M18<60,'Member Details'!K25=\"Yes\"),SUM(E23+D25),SUM(D21+D25))","v":{"$error":"#N/A"}}]
[]
["Remaining Tax-Free Lump Sum Availability"]
[]
["Lump Sum Allowance (LSA)",null,null,268275]
["Lump Sum Allowance (LSA) remaining",null,null,{"$f":"D31-D27","v":{"$error":"#N/A"}}]
[]
["Lump Sum Death Benefit Allowance (LSDBA)",null,null,1073100]
["Lump Sum Death Benefit Allowance (LSDBA) remaining",null,null,{"$f":"D34-D27","v":{"$error":"#N/A"}}]
[]
["HMRC Lifetime Allowance (LTA)"]
[]
["Lifetime Allowance",null,null,1073100]
["Value of Crystallised Benefits",null,null,{"$f":"(D16*20)+D27","v":{"$error":"#N/A"}}]
["Percentage of LTA Used (%)",null,null,{"$f":"(D40/D39)*100","v":{"$error":"#N/A"}}]
["Value of LTA Unused",null,null,{"$f":"IF(D39-D40<0,0,D39-D40)","v":{"$error":"#N/A"}}]
["Percentage of LTA Unused (%)",null,null,{"$f":"IF(100-D41<0,0,100-D41)","v":{"$error":"#N/A"}}]

{"sheet":"Letter","index":9,"n_rows":103,"n_cols":8,"rows_kept":103,"cut":false,"hidden":true,"merged":[[4,6,4,7],[5,6,5,7],[6,6,6,7],[10,0,10,2],[9,0,9,2],[8,0,8,2],[10,6,10,7],[27,6,27,7],[27,4,27,5],[12,6,12,7],[29,0,29,7],[20,0,20,7],[25,0,25,1],[26,0,26,1],[27,0,27,1],[25,2,25,3],[74,0,81,8],[102,0,109,8],[61,0,72,8],[82,0,101,8],[31,14,31,15],[32,0,32,7],[50,0,50,3],[33,0,33,1],[33,2,33,3],[33,4,33,5],[33,6,33,7],[38,0,42,7],[35,0,37,7],[43,0,44,7],[31,12,31,13],[11,0,11,2],[30,2,30,3],[11,6,11,7],[30,6,30,7],[26,2,26,3],[27,2,27,3],[25,4,25,5],[26,4,26,5],[16,6,16,7],[22,0,23,7],[30,0,30,1],[12,0,12,2],[30,4,30,5],[18,0,18,3],[25,6,25,7],[26,6,26,7]]}
[]
[]
[]
[]
[null,null,null,null,null,null,"7 Tweedside Park"]
[null,null,null,null,null,null,"Tweedbank"]
[null,null,null,null,null,null,"Galashiels"]
[null,null,null,null,null,null,null,"TD1 3TE"]
[{"$f":"'Member Details'!K8&\" \"&'Member Details'!L8&\" \"&'Member Details'!M8","v":"  "},null,null,null,null,null,null,"www.pensions.gov.scot"]
[{"$f":"'Member Details'!K32","v":0}]
[{"$f":"'Member Details'!K33","v":0},null,null,null,null,null,"Tel:   01896 893000"]
[{"$f":"'Member Details'!K34","v":0},null,null,null,null,null,"Fax:  01896 893214"]
[{"$f":"'Member Details'!K35","v":0},null,null,null,null,null,"nhsawards@gov.scot"]
[{"$f":"'Member Details'!K36","v":0}]
[null,null,null,null,null,null,"Our ref: ",{"$f":"'Member Details'!K10","v":0}]
[null,null,null,null,null,null,"Letter Ref: ","Pres v1.0"]
[null,null,null,null,null,null,{"$f":"NOW()","v":"2026-03-20T08:00:15.720"}]
[]
[{"$f":"\"Dear \"&'Member Details'!K8&\" \"&'Member Details'!M8","v":"Dear  "}]
[]
["National Health Service Superannuation Scheme (Scotland)"]
[]
["In accordance with your request please find enclosed an estimate of your retirement benefits.  You should read the notes for further explanatory information."]
[]
[]
["Name",null,{"$f":"'Member Details'!L8&\" \"&'Member Details'!M8","v":" "},null,"National Insurance No",null,{"$f":"'Member Details'!K38","v":0}]
["Date of Birth  ",null,{"$f":"'Member Details'!K12","v":"00:00:00"},null,"Superannuation No",null,{"$f":"'Member Details'!K10","v":0}]
["Normal Retirement Date",null,{"$f":"IF('Member Details'!K14=1995,DATE(YEAR('Member Details'!K12)+60,MONTH('Member Details'!K12),DAY('Member Details'!K12)),DATE(YEAR('Member Details'!K12)+65,MONTH('Member Details'!K12),DAY('Member Details'!K12)))","v":"1964-12-31"},null,"Normal Pension Age",null,{"$f":"IF('Member Details'!K14=1995,60,65)","v":65}]
[]
[{"$f":"\"Service/Salary Details at Last Date of Pensionable Service (\"&TEXT('Member Details'!K16,\"dd/mm/yyyy\")&\")\"","v":"Service/Salary Details at Last Date of Pensionable Service (00/01/1900)"}]
["Pensionable Service",null,{"$f":"'Member Details'!K21&\" Years \"&'Member Details'!M21&\" Days\"","v":" Years  Days"},null,"Pensionable Salary",null,{"$f":"'Member Details'!K18","v":0}]
[]
[{"$f":"IF('Member Details'!Q25<>\"\",\"Estimated Current Retirement Benefits (\"&TEXT('Member Details'!Q25,\"dd/mm/yyyy\")&\")\",\"Estimated Current Retirement Benefits (\"&TEXT(Letter!G17,\"dd/mm/yyyy\")&\")\")","v":"Estimated Current Retirement Benefits (20/03/2026)"}]
["Pension",null,{"$f":"'Benefit Certificate'!D16","v":{"$error":"#N/A"}},null,"Lump Sum",null,{"$f":"IF('Member Details'!K14=1995,ROUND('Benefit Certificate'!D27,2),\"No Automatic Lump Sum\")","v":"No Automatic Lump Sum"}]
[]
["As you are no longer in pensionable employment, your basic retirement benefits should remain unchanged.  These will be index linked in line with inflation until retirement.  "]
[]
[]
["This is not a statement of your legal entitlement and is intended for illustrative purposes only.  Exact figures for retirement benefits cannot be given until an application for retirement benefits has been made in accordance with the scheme rules.  Scottish Public Pensions Agency will accept no responsibility for the accuracy of this information."]
[]
[]
[]
[]
["If you require any further information please do not hesitate to contact the Agency at the above address."]
[]
[]
["Yours sincerely"]
[]
[]
[]
["SPPA Customer Services"]
[]
[]
[]
[]
[]
[]
[]
[]
[]
[]
["Pensionable Salary\n\nFor members of the 1995 section of the NHS Superannuation Scheme (Scotland) the pensionable salary used to calculate scheme benefits on retirement is the best of the last 3 years, this means the pensionable salary taken back 365 days from the date of retirement as supplied by your employer.\n\nFor members of the 2008 section of the NHS Superannuation Scheme (Scotland) the salary used in calculating your retirement benefits is calculated as the average of the best consecutive 3 years’ revalued salaries in the last 10 years.\n\nFor the purposes of this illustration your salary information has been based on your preserved pensionable salary.  If you were part-time, this will be based on the full time equivalent salary rate.  We would emphasise that while every effort has been made to ensure the accuracy of your pensionable salary it is not until you retire that an accurate calculation can be made.\n"]
[]
[]
[]
[]
[]
[]
[]
[]
[]
[]
[]
[]
["Pensionable Service\n\nThis is the period of employment that is taken into account when working out pension benefits. The figure quoted is your pensionable service to your last day worked. It will include any service you have already transferred into the scheme from another pension scheme.  Please note that part-time service is converted to the equivalent full time service.  For example, if you worked 18.75 hours per week instead of 37.5 for a full time employment then you would accrue 183 days service instead of 365 for each year.  No projected service has been added as you have left pensionable employment.\n"]
[]
[]
[]
[]
[]
[]
[]
["Estimated Current Benefits\n\n1995 Member\n\nIf you are a 1995 section member, your annual pension has been calculated using the following formula:\n\nPension:       Pensionable Service x Pensionable Salary x 1/80th\nLump Sum:   Pensionable Service x Pensionable Salary x 3/80th\n\nIf you worked after 30 March 2000, you may take you benefits prior to Normal Pension Age (NPA) of 60.  Any benefits payable prior to NPA will normally be subject to an actuarial reduction to allow for the benefits being paid earlier.\n\n2008 Member\n\nIf you are a 2008 section member, your annual pension has been calculated using the following formula:\n\nPension:       Pensionable Service x Pensionable Salary x 1/60th\nLump Sum:   No Automatic Lump Sum\n\nAny benefits payable prior to NPA of 65 will normally be subject to an actuarial reduction to allow for the benefits being paid earlier.\n\n"]
[]
[]
[]
[]
[]
[]
[]
[]
[]
[]
[]
[]
[]
[]
[]
[]
[]
[]
[]
["Increasing your Tax Free Lump Sum\n\nThere is the provision to give up an amount of pension in exchange for an additional lump sum up to the maximum allowed by HM Revenue & Customs of 25% of the fund value.  There is a Commutation Calculator on our website that can be used to project estimated values.  The factor for converting your pension into lump sum is 12:1 which means that for every £1 of pension you give up, you will get £12 added to your lump sum."]

{"sheet":"Practitioners Member Details","index":10,"n_rows":35,"n_cols":21,"rows_kept":35,"cut":false,"hidden":true,"merged":[[13,8,13,9],[13,10,13,13],[1,2,3,4],[1,5,3,18],[5,9,5,14],[7,8,7,9],[7,12,7,13],[8,2,8,4],[9,2,9,4],[9,10,9,13],[11,8,11,9],[11,10,11,13],[9,7,9,9],[14,2,14,4],[15,2,15,4],[15,10,15,13],[17,2,17,4],[17,10,17,13],[17,7,17,9],[15,7,15,9],[21,14,21,15],[21,16,21,17],[26,8,26,15],[28,8,28,9],[28,10,28,13],[32,8,32,9],[32,10,32,13],[34,8,34,9],[34,10,34,13],[19,10,19,13],[19,7,19,9],[29,8,29,9],[29,10,29,13],[30,8,30,9],[30,10,30,13],[31,8,31,9],[31,10,31,13],[21,10,21,13]]}
[]
[null,null,null,null,null,"NHS Superannuation Scheme (Scotland) Preserved Benefits Estimate Calculator"]
[]
[]
[]
[null,null,null,null,"Practitioner Member Details",null,null,null,null,"PLEASE COMPLETE ALL NECESSARY DATA"]
[]
[null,null,null,null,null,null,null,null,"Members Name  ",null,null,null,null,null,null,"Eg: Mr | J | Smith"]
[]
[null,null,null,null,null,null,null,"Superannuation Number  "]
[]
[null,null,null,null,null,null,null,null,"Date of Birth  ",null,null,null,null,null,null,null,null,null,null,{"$f":"DATEDIF(K12,NOW(),\"Y\")","v":126},"Yes"]
[null,null,null,null,null,null,null,null,null,null,null,null,null,null,null,null,null,null,null,null,"No"]
[null,null,null,null,null,null,null,null,"Scheme  ",null,null,null,null,null,null,null,null,null,1995]
[null,null,null,null,null,null,null,null,null,null,null,null,null,null,null,null,null,null,2008]
[null,null," ",null,null,null,null,"Last Day Worked in NHS  ",null,null,null,null,null,null,null,{"$f":"K16+1","v":"1900-01-01"},{"$f":"IF(R16>=S16,\"VERA\",\"AGE\")","v":"AGE"},{"$f":"K16","v":0},36616]
[]
[null,null," ",null,null,null,null,"Deferred Basic Pension  "]
[]
[null,null,null,null,null,null,null,{"$f":"IF(K14=2008,\"\",\"Deferred Basic Lump Sum  \")","v":"Deferred Basic Lump Sum  "}]
[]
[null,null,null,null,null,null,null,null,null,{"$f":"IF(T12>=55,\"Are you looking for a Retirement Estimate?  \",\"\")","v":"Are you looking for a Retirement Estimate?  "},null,null,null,null,{"$f":"IF(K22=\"Yes\",\"Retirement Date  \",\"\")","v":""},null,null,null,"Yes"]
[null,null,null,null,null,null,null,null,null,null,null,null,null,null,null,null,null,null,"No"]
[]
[]
[]
[null,null,null,null,null,null,null,null,"Additional Information if Letter and Certificate Required"]
[]
[null,null,null,null,null,null,null,null,"Address Line 1  "]
[null,null,null,null,null,null,null,null,"Address Line 2  "]
[null,null,null,null,null,null,null,null,"Address Line 3  "]
[null,null,null,null,null,null,null,null,"Address Line 4  "]
[null,null,null,null,null,null,null,null,"Post Code  "]
[]
[null,null,null,null,null,null,null,null,"NI Number  "]

{"sheet":"Practitioners Letter","index":11,"n_rows":87,"n_cols":8,"rows_kept":87,"cut":false,"hidden":true,"merged":[[86,0,108,8],[110,0,113,8],[65,0,85,8],[32,0,34,7],[35,0,39,7],[40,0,41,7],[49,0,49,3],[28,14,28,15],[29,0,29,7],[30,0,30,1],[30,2,30,3],[30,4,30,5],[30,6,30,7],[28,12,28,13],[26,0,26,1],[26,2,26,3],[26,4,26,5],[26,6,26,7],[27,0,27,1],[27,2,27,3],[27,4,27,5],[27,6,27,7],[22,0,23,7],[25,0,25,1],[25,2,25,3],[25,4,25,5],[25,6,25,7],[9,0,9,2],[20,0,20,7],[4,6,4,7],[5,6,5,7],[6,6,6,7],[8,0,8,2],[10,0,10,2],[10,6,10,7],[11,0,11,2],[11,6,11,7],[12,0,12,2],[12,6,12,7],[16,6,16,7],[18,0,18,3],[13,0,13,2],[14,0,14,2]]}
[]
[]
[]
[]
[null,null,null,null,null,null,"7 Tweedside Park"]
[null,null,null,null,null,null,"Tweedbank"]
[null,null,null,null,null,null,"Galashiels"]
[null,null,null,null,null,null,null,"TD1 3TE"]
[{"$f":"'Practitioners Member Details'!K8&\" \"&'Practitioners Member Details'!L8&\" \"&'Practitioners Member Details'!M8","v":"  "},null,null,null,null,null,null,"www.pensions.gov.scot"]
[{"$f":"'Practitioners Member Details'!K29","v":0}]
[{"$f":"'Practitioners Member Details'!K30","v":0},null,null,null,null,null,"Tel:   01896 893000"]
[{"$f":"'Practitioners Member Details'!K31","v":0},null,null,null,null,null,"Fax:  01896 893214"]
[{"$f":"'Practitioners Member Details'!K32","v":0},null,null,null,null,null,"nhspractitioner@gov.scot"]
[{"$f":"'Practitioners Member Details'!K33","v":0}]
[null,null,null,null,null,null,"Our ref: ",{"$f":"'Practitioners Member Details'!K10","v":0}]
[null,null,null,null,null,null,"Letter Ref: ","Pres v1.0"]
[null,null,null,null,null,null,{"$f":"NOW()","v":"2026-03-20T08:00:15.720"}]
[]
[{"$f":"\"Dear \"&'Practitioners Member Details'!K8&\" \"&'Practitioners Member Details'!M8","v":"Dear  "}]
[]
["National Health Service Superannuation Scheme (Scotland)"]
[]
["In accordance with your request please find enclosed an estimate of your retirement benefits.  You should read the notes for further explanatory information."]
[]
[]
["Name",null,{"$f":"'Practitioners Member Details'!L8&\" \"&'Practitioners Member Details'!M8","v":" "},null,"National Insurance No",null,{"$f":"'Practitioners Member Details'!K35","v":0}]
["Date of Birth",null,{"$f":"'Practitioners Member Details'!K12","v":"00:00:00"},null,"Superannuation No",null,{"$f":"'Practitioners Member Details'!K10","v":0}]
["Normal Retirement Date",null,{"$f":"IF('Practitioners Member Details'!K14=1995,DATE(YEAR('Practitioners Member Details'!K12)+60,MONTH('Practitioners Member Details'!K12),DAY('Practitioners Member Details'!K12)),DATE(YEAR('Practitioners Member Details'!K12)+65,MONTH('Practitioners Member Details'!K12),DAY('Practitioners Member Details'!K12)))","v":"1964-12-31"},null,"Normal Pension Age",null,{"$f":"IF('Practitioners Member Details'!K14=1995,60,65)","v":65}]
[]
[{"$f":"IF('Practitioners Member Details'!Q22<>\"\",\"Estimated Current Retirement Benefits (\"&TEXT('Practitioners Member Details'!Q22,\"dd/mm/yyyy\")&\")\",\"Estimated Current Retirement Benefits (\"&TEXT(G17,\"dd/mm/yyyy\")&\")\")","v":"Estimated Current Retirement Benefits (20/03/2026)"}]
["Pension",null,{"$f":"'Practitioners Ben Certificate'!D16","v":{"$error":"#N/A"}},null,"Lump Sum",null,{"$f":"IF('Practitioners Member Details'!K14=1995,ROUND('Practitioners Ben Certificate'!D27,2),\"No Automatic Lump Sum\")","v":"No Automatic Lump Sum"}]
[]
["As you are no longer in pensionable employment, your basic retirement benefits should remain unchanged.  These will be index linked in line with inflation until retirement.  "]
[]
[]
["This is not a statement of your legal entitlement and is intended for illustrative purposes only.  Exact figures for retirement benefits cannot be given until an application for retirement benefits has been made in accordance with the scheme rules.  Scottish Public Pensions Agency will accept no responsibility for the accuracy of this information."]
[]
[]
[]
[]
["If you require any further information please do not hesitate to contact the Agency at the above address."]
[]
[]
["Yours sincerely"]
[]
[]
[]
[]
[]
["NHS Practitioners Team"]
[]
[]
[]
[]
[]
[]
[]
[]
[]
[]
[]
[]
[]
[]
[]
["Notes\n\nPension benefits for service as a practitioner are based on pensionable remuneration earned in each financial year which is then uprated by factors to a current value at the date of ceasing to pay contributions and added together to give the Total Uprated Superannable Remuneration (TUSR).\n\nThe pension in the 1995 Section of the Scheme is calculated at 1.4% of the TUSR and the tax free lump sum as 4.2% of the TUSR.\n\nIn the 2008 Section the pension is calculated at 1.87% of the TUSR.  There is no automatic tax free lump sum however there is provision to give up an amount of pension in exchange for a tax free lump sum.  Further information is provided below.\n\nPension benefits for non-practitioner earnings are based on an accrual rate of 1/80th for the 1995 section and 1/60th for the 2008 section.\n\nPension flexibilities for practitioners have been applied but these cannot be fully tested until retirement when the highest possible benefits will be paid.\n\nAny service purchased as the result of an added years contract has been included in the estimate as a proportional credit.\n\nPractitioner earnings and the Consumer Price Index rates are not available in advance therefore SPPA do not provide projections of benefits."]
[]
[]
[]
[]
[]
[]
[]
[]
[]
[]
[]
[]
[]
[]
[]
[]
[]
[]
[]
[]
["Increasing your Tax Free Lump Sum\n\nThere is the provision to give up an amount of pension in exchange for an additional lump sum up to the maximum allowed by HM Revenue & Customs of 25% of the fund value.  There is a Commutation Calculator on our website that can be used to project estimated values.  The factor for converting your pension into lump sum is 12:1 which means that for every £1 of pension you give up, you will get £12 added to your lump sum."]

{"sheet":"Practitioners PI Finder","index":12,"n_rows":9,"n_cols":7,"rows_kept":9,"cut":false,"hidden":true,"merged":[]}
[]
[null,null,null,null,null,"yyyy","PI Date"]
[null,null,"Select PI table:",null,null,{"$f":"IF(AND('Practitioners Member Details'!K25=\"Yes\",'Practitioners Member Details'!Q25<G3),2022,2023)","v":2023},"2023-04-06"]
[]
[null,null,null,null,null,"dd/mm/yyyy"]
[null,null,"Enter date for PI:",null,null,{"$f":"'Practitioners Member Details'!P16","v":"1900-01-01"}]
[]
[]
[null,null,"PI for this date is:",null,null,{"$f":"IF(F6=0/1/1900,1,VLOOKUP(F6,'PI Data'!$A$3:$AZ$998,F3 - 'PI Data'!$A$1 + 2))","v":{"$error":"#N/A"}}]

{"sheet":"Practitioners Ben Certificate","index":13,"n_rows":35,"n_cols":11,"rows_kept":35,"cut":false,"hidden":true,"merged":[[10,0,10,1],[10,2,10,3],[0,0,0,4],[1,0,1,4],[2,0,2,4],[3,0,3,4],[4,2,4,3],[5,2,5,3],[6,0,6,4],[7,0,7,2],[7,3,7,4],[9,0,9,2],[9,3,9,4],[21,0,21,1],[11,0,11,1],[11,2,11,3],[12,0,12,1],[13,0,13,1],[13,3,13,4],[15,0,15,1],[15,3,15,4],[17,0,17,4],[18,0,18,2],[18,3,18,4],[20,0,20,2],[20,3,20,4],[30,0,30,2],[30,3,30,4],[22,0,22,1],[22,2,22,3],[23,0,23,4],[24,0,24,2],[24,3,24,4],[25,0,25,4],[26,0,26,1],[26,3,26,4],[28,0,28,4],[29,0,29,2],[29,3,29,4],[34,0,34,2],[34,3,34,4],[31,0,31,2],[31,3,31,4],[32,0,32,2],[32,3,32,4],[33,0,33,2],[33,3,33,4]]}
[{"$f":"IF('Practitioners Member Details'!K14=1995,\"NHS 1995 Section\",\"NHS 2008 Section\")","v":"NHS 2008 Section"}]
["Estimated Retirement Benefits from Deferred Status"]
[{"$f":"IF(AND('Practitioners Member Details'!Q16=\"VERA\",Age!M18<60,'Practitioners Member Details'!K23=\"Yes\"),\"with Actuarial Reduced Pension\",\"\")","v":""}]
[{"$f":"IF('Practitioners Member Details'!Q23<>\"\",'Practitioners Member Details'!Q23,NOW())","v":"2026-03-20T08:00:15.720"}]
["Name:",{"$f":"'Practitioners Member Details'!K8&\" \"&'Practitioners Member Details'!L8&\" \"&'Practitioners Member Details'!M8","v":"  "},"Last day of Service:",null,{"$f":"'Practitioners Member Details'!K16","v":"00:00:00"}]
["NI Number:",{"$f":"'Practitioners Member Details'!K35","v":0},"Reference:",null,{"$f":"'Practitioners Member Details'!K10","v":0}]
["Annual Pension"]
[]
[]
["Deferred Basic Total Pension",null,null,{"$f":"'Practitioners Member Details'!K18","v":0}]
[null,null,null,null,null,null,null,null,"VERA 1995",null,"VERA 2008"]
[{"$f":"IF(AND('Practitioners Member Details'!Q16=\"VERA\",Age!M18<60,'Practitioners Member Details'!K22=\"Yes\"),\"Less early retirement reduction (\"&G12&\"%)\",\" \")","v":" "},null,{"$f":"IF(AND('Practitioners Member Details'!Q16=\"VERA\",Age!M18<60,'Practitioners Member Details'!K23=\"Yes\",'Practitioners Member Details'!K14=1995),\"£\" & ROUND(D10,2) & \" x \" & I12,IF(AND('Practitioners Member Details'!Q16=\"VERA\",Age!M18<65,'Practitioners Member Details'!K23=\"Yes\",'Practitioners Member Details'!K14=2008),\"£\" & ROUND(D10,2) & \" x \" & K12,\" \"))","v":" "},null,{"$f":"IF(AND('Practitioners Member Details'!Q16=\"VERA\",Age!M18<60,'Practitioners Member Details'!K22=\"Yes\",'Practitioners Member Details'!K14=1995),D10*I12,IF(AND('Practitioners Member Details'!Q16=\"VERA\",Age!M18<65,'Practitioners Member Details'!K22=\"Yes\",'Practitioners Member Details'!K14=2008),D10*K12,0))","v":0},{"$f":"IF(AND('Practitioners Member Details'!K14=1995,I12<>\"\"),((1-I12)*100),IF(AND('Practitioners Member Details'!K14=2008,K12<>\"\"),((1-K12)*100),\"\"))","v":""},{"$f":"IF(F12<>\"\",ROUND(F12,2),\"\")","v":""},null,{"$f":"IF(AND('Practitioners Member Details'!Q16=\"VERA\",Age!M18<60,'Practitioners Member Details'!K22=\"Yes\",'Practitioners Member Details'!K14=1995),IF('Practitioners Member Details'!Q22<45110,VLOOKUP(Age!M18,'VERA Pension Factors'!A7:M18,MATCH(Age!M19,'VERA Pension Factors'!A7:M7,0),FALSE),VLOOKUP(Age!M18,'VERA Pension Factors'!P7:AB18,MATCH(Age!M19,'VERA Pension Factors'!P7:AB7,0),FALSE)),\"\")","v":""},null,{"$f":"IF(AND('Practitioners Member Details'!Q16=\"VERA\",Age!M18<65,'Practitioners Member Details'!K22=\"Yes\",'Practitioners Member Details'!K14=2008),IF('Practitioners Member Details'!Q22<45110,VLOOKUP(Age!M18,'VERA Pension Factors'!A44:M53,MATCH(Age!M19,'VERA Pension Factors'!A36:M36,0),FALSE),VLOOKUP(Age!M18,'VERA Pension Factors'!P44:AB53,MATCH(Age!M19,'VERA Pension Factors'!P36:AB36,0),FALSE)),\"\")","v":""}]
[]
[{"$f":"IF('Practitioners PI Finder'!F9>1,\"Plus Pension Increase\" &\" (\"&F14&\")\",\" \")","v":{"$error":"#N/A"}},null,null,{"$f":"IF('Practitioners PI Finder'!F9>1,IF(E12<>0,(E12*F14)-E12,(D10*F14)-D10),0)","v":{"$error":"#N/A"}},null,{"$f":"IF('Practitioners PI Finder'!F9>1,ROUND('Practitioners PI Finder'!F9,4),0)","v":{"$error":"#N/A"}}]
[]
["Estimated Annual Pension",null,null,{"$f":"IF(AND('Practitioners Member Details'!Q16=\"VERA\",Age!M18<60,'Practitioners Member Details'!K22=\"Yes\"),SUM(E12+D14),SUM(D10+D14))","v":{"$error":"#N/A"}}]
[]
["Lump Sum"]
[]
[]
["Deferred Basic Lump Sum",null,null,{"$f":"'Practitioners Member Details'!K20","v":0}]
[{"$f":"IF('Practitioners Member Details'!K14=2008,\"No Automatic Lump Sum given.\",\"\")","v":""},null,null,null,null,null,null,null,"VERA LS"]
[{"$f":"IF(AND('Practitioners Member Details'!Q16=\"VERA\",Age!M18<60,'Practitioners Member Details'!K22=\"Yes\",'Practitioners Member Details'!K14=1995),\"Less early retirement reduction (\"&G23&\"%)\",\" \")","v":" "},null,{"$f":"IF(AND('Practitioners Member Details'!Q16=\"VERA\",Age!M18<60,'Practitioners Member Details'!K23=\"Yes\",'Practitioners Member Details'!K14=1995),\"£\" & ROUND(D21,2) & \" x \" & I23,\" \")","v":" "},null,{"$f":"IF(AND('Practitioners Member Details'!Q16=\"VERA\",Age!M18<60,'Practitioners Member Details'!K22=\"Yes\",'Practitioners Member Details'!K14=1995),ROUND('Practitioners Ben Certificate'!D21,2)*'Practitioners Ben Certificate'!I23,0)","v":0},{"$f":"IF(AND('Practitioners Member Details'!Q16=\"VERA\",Age!M18<60,'Practitioners Member Details'!K14=1995),(1-'Practitioners Ben Certificate'!I23)*100,\"\")","v":""},{"$f":"IF(F23<>\"\",ROUND(F23,2),\"\")","v":""},null,{"$f":"IF(AND('Practitioners Member Details'!Q16=\"VERA\",Age!M18<60,'Practitioners Member Details'!K22=\"Yes\",'Practitioners Member Details'!K14=1995),IF('Practitioners Member Details'!Q22<45110,VLOOKUP(Age!M18,'VERA LS Factors'!A7:M19,MATCH(Age!M19,'VERA LS Factors'!A7:M7,0),FALSE),VLOOKUP(Age!M18,'VERA LS Factors'!P7:AB19,MATCH(Age!M19,'VERA LS Factors'!P7:AB7,0),FALSE)),\"\")","v":""}]
[{"$f":"IF('Practitioners Member Details'!K14=2008,\"You may wish to give up part of your pension to receive a tax free Lump Sum.\",\"\")","v":""}]
[{"$f":"IF(AND('Practitioners PI Finder'!F9>1,'Practitioners Member Details'!K14=1995),\"Plus Pension Increase\" &\" (\"&F25&\")\",\" \")","v":{"$error":"#N/A"}},null,null,{"$f":"IF(AND('Practitioners PI Finder'!F9>1,'Practitioners Member Details'!K14=1995),IF(E23<>0,(E23*F25)-E23,(D21*F25)-D21),0)","v":{"$error":"#N/A"}},null,{"$f":"IF(AND('Practitioners PI Finder'!F9>1,'Practitioners Member Details'!K14=1995),ROUND('Practitioners PI Finder'!F9,4),0)","v":{"$error":"#N/A"}}]
[{"$f":"IF('Practitioners Member Details'!K14=2008,\"The maximum allowed by HM Revenue & Customs is 25% of your Fund Value.\",\"\")","v":""}]
[{"$f":"IF('Practitioners Member Details'!K14=1995,\"Estimated Lump Sum\",\"\")","v":""},null,null,{"$f":"IF(AND('Practitioners Member Details'!Q16=\"VERA\",Age!M18<60,'Practitioners Member Details'!K22=\"Yes\"),SUM(E23+D25),SUM(D21+D25))","v":{"$error":"#N/A"}}]
[]
["HMRC Lifetime Allowance (LTA)"]
[]
["Lifetime Allowance",null,null,1073100]
["Value of Crystallised Benefits",null,null,{"$f":"(D16*20)+D27","v":{"$error":"#N/A"}},null,null,"Tax Charge Message"]
["Percentage of LTA Used (%)",null,null,{"$f":"(D32/D31)*100","v":{"$error":"#N/A"}}]
["Value of LTA Unused",null,null,{"$f":"IF(D31-D32<0,0,D31-D32)","v":{"$error":"#N/A"}}]
["Percentage of LTA Unused (%)",null,null,{"$f":"IF(100-D33<0,0,100-D33)","v":{"$error":"#N/A"}}]