{"text_format":"1","workbook":"xlsx","n_sheets":12,"sheets":["Contributions calculator","Printable estimate","Guidance notes","Codes","State pension age","Lump Sum","NRA60","NRA65","NRA66","NRA67","NRA68","ERF"],"not_rendered":{"charts":0,"images":1,"macros":1,"external_links":0,"defined_names":13,"comments":1,"pivot_tables":0},"unopened":[],"bounds":{"document_bytes":16777216,"sheet_cells":100000,"rows_first":2000,"rows_last":500,"rows_between":2000,"halvings":0,"cell_chars":16384,"cell_head_chars":4096},"cells_cut":0,"cells_raw":0,"read":"whole","date_system":"1900"}

{"sheet":"Contributions calculator","index":0,"n_rows":33,"n_cols":11,"rows_kept":33,"cut":false,"hidden":false,"merged":[[27,1,27,2],[28,1,28,2],[26,1,26,2],[30,1,30,6],[1,2,1,6]]}
[]
[null,null,"Teachers Additional Pension Benefit Cost Calculator"]
[null,null,"Member Details"]
[null,null,"Date of Birth:  ",null,null,null,null,null,{"$f":"IF(I9=\"Election must start before normal pension age\",\"Error\",\"\")","v":""}]
[]
[null,null,"Normal pension age*  "]
[null,null,"Prospective Normal Pension Age",{"$f":"VLOOKUP(D4,'State pension age'!B4:E50,3,TRUE)","v":65},{"$f":"IF(OR(D7=\"\",D7=0),\"\",\"Years\")","v":"Years"},{"$f":"VLOOKUP(D4,'State pension age'!B4:E50,4,TRUE)","v":0},"Months"]
[]
[null,null,"Date of AP election:  ",null,null,null,null,null,{"$f":"IF(OR(D12=\"\"),\"\",IF(D11>=Codes!E8,\"Election must start before normal pension age\",\"\"))","v":""}]
[]
{"$rows_left_out":24}
{"sheet":"Printable estimate","index":1,"n_rows":28,"n_cols":5,"rows_kept":28,"cut":false,"hidden":true,"merged":[[27,1,27,5],[2,1,2,5]]}
[]
[]
[null,"Illustration of additional pension benefit cost"]
[]
[null,"Your details"]
[null,"Date of Birth:",null,{"$f":"'Contributions calculator'!D4","v":"00:00:00"}]
[]
[null,"Normal pension age:",null,{"$f":"IF(Codes!F8>0,Codes!E8&\" years\",Codes!E8)","v":"65 years"},{"$f":"IF(Codes!F8>0,Codes!F8&\" months\",\"\")","v":" months"}]
[]
[null,"Date of election:",null,{"$f":"'Contributions calculator'!D9","v":"00:00:00"}]
{"$rows_left_out":19}
{"sheet":"Guidance notes","index":2,"n_rows":39,"n_cols":6,"rows_kept":39,"cut":false,"hidden":true,"merged":[]}
[]
[null,"Additional Pension guidance notes"]
[null,"Disclaimer:\nThis calculation is intended for illustrative purposes only. This is not a statement of you legal entitlement. While every care has been taken in the preparation of this calculator the Scottish Public Pension Agency will accept no responsibility for the accuracy of the information it provides.\n\nPlease refer to pages on the SPPA website for points of contact and other benefits available."]
[null,"Using the calculator\nYou must be a contributing member of the Scottish Teachers Pension Scheme 2015 if you wish to purchase additional pension.\n\nAdditional pension benefits will be paid with your scheme retirement benefits and will be index linked.\n\nThe cost of purchasing depends on your age and the amount of additional pension you wish to receive.\n\nThere are two ways you can pay for AP. You can pay by having regular deductions taken from your monthly salary or by paying a one off lump sum.\n\nAdditional pension must be bought in multiples of £250. Therefore the minimum amount available to purchase is £250.\n\nThe maximum for each scheme is:\n\n• Scottish Teachers Superannuation Scheme  £6800\n• Scottish Teachers Pension Scheme 2015  £7000"]
[null,"SPPA\n7 Tweedside Park\nGalashiels\nTD1 3TE                         Telephone: 01896 893000"]
[]
[]
[]
[]
[]
{"$rows_left_out":30}
{"sheet":"Codes","index":3,"n_rows":231,"n_cols":16,"rows_kept":231,"cut":false,"hidden":true,"merged":[[5,4,5,5]]}
[null,"DOB between","Payment","Form of AP","NPA Options","Lump sum table",null,null,"AP Table results"]
[null,{"$f":"TODAY()-365.25*85","v":"1939-06-04T18:00:00"},"Lump Sum","Member only",60,{"$f":"IF('Contributions calculator'!J6=60,\"APS60\",IF('Contributions calculator'!J6=65,\"APS65\",IF('Contributions calculator'!J6=\"SPA\",\"APS\"&'Contributions calculator'!D7,\"\")))","v":""},null,"APS60","Lump sum NPA 60",{"$f":"IF('Contributions calculator'!D23=Codes!D2,VLOOKUP('Contributions calculator'!D11,'Lump Sum'!B9:D60,2,FALSE),IF('Contributions calculator'!D23=Codes!D3,VLOOKUP('Contributions calculator'!D11,'Lump Sum'!B9:D60,3,FALSE),\"\"))","v":""}]
[null,{"$f":"TODAY()-365.25*18","v":"2006-06-04T12:00:00"},{"$f":"IF(OR('Contributions calculator'!D12=0,'Contributions calculator'!D12=1),\"\",\"Regular contributions\")","v":"Regular contributions"},"Member and dependant",65,null,null,"APS65","Lump sum NPA 65",{"$f":"IF('Contributions calculator'!D23=Codes!D2,VLOOKUP('Contributions calculator'!D11,'Lump Sum'!F9:H60,2,FALSE),IF('Contributions calculator'!D23=Codes!D3,VLOOKUP('Contributions calculator'!D11,'Lump Sum'!F9:H60,3,FALSE),\"\"))","v":""}]
[null,null,null,null,"State Pension Age",null,null,"APS66","Lump sum NPA 66",{"$f":"IF('Contributions calculator'!D23=Codes!D2,VLOOKUP('Contributions calculator'!D11,'Lump Sum'!J9:L60,2,FALSE),IF('Contributions calculator'!D23=Codes!D3,VLOOKUP('Contributions calculator'!D11,'Lump Sum'!J9:L60,3,FALSE),\"\"))","v":""}]
[null,null,null,null,null,null,null,"APS67","Lump sum NPA 67",{"$f":"IF('Contributions calculator'!D23=Codes!D2,VLOOKUP('Contributions calculator'!D11,'Lump Sum'!N9:P60,2,FALSE),IF('Contributions calculator'!D23=Codes!D3,VLOOKUP('Contributions calculator'!D11,'Lump Sum'!N9:P60,3,FALSE),\"\"))","v":""}]
[null,"Yes/No","Years (N)",null,"Chosen NPA",null,null,"APS68","Lump sum NPA 68",{"$f":"IF('Contributions calculator'!D23=Codes!D2,VLOOKUP('Contributions calculator'!D11,'Lump Sum'!R9:T60,2,FALSE),IF('Contributions calculator'!D23=Codes!D3,VLOOKUP('Contributions calculator'!D11,'Lump Sum'!R9:T60,3,FALSE),\"\"))","v":""}]
[null,"Yes",0,null,"Years","Months",null,"P60","Regular conts for personal AP of £250 with PNPA 60",{"$f":"INDEX('NRA60'!$W$6:$AQ$58,MATCH('Contributions calculator'!$D$11,'NRA60'!$W$6:$W$58,0),MATCH('Contributions calculator'!$D$21,'NRA60'!$W$6:$AQ$6,0))","v":{"$error":"#N/A"}}]
[null,"No",{"$f":"IF(OR('Contributions calculator'!D7=66,'Contributions calculator'!D7=67,'Contributions calculator'!D7=68),1,\"\")","v":""},null,{"$f":"IF('Contributions calculator'!J6=60,60,IF('Contributions calculator'!J6=65,65,IF(OR('Contributions calculator'!J6=\"SPA\",'Contributions calculator'!J6=\"\"),'Contributions calculator'!D7,\"\")))","v":65},{"$f":"IF('Contributions calculator'!J6=60,0,IF('Contributions calculator'!J6=65,0,IF('Contributions calculator'!J6=\"SPA\",'Contributions calculator'!F7,\"\")))","v":""},null,"P65","Regular conts for personal AP of £250 with PNPA 65",{"$f":"INDEX('NRA65'!$W$6:$AQ$58,MATCH('Contributions calculator'!$D$11,'NRA65'!$W$6:$W$58,0),MATCH('Contributions calculator'!$D$21,'NRA65'!$W$6:$AQ$6,0))","v":{"$error":"#N/A"}}]
[null,null,{"$f":"IF(OR('Contributions calculator'!D7=67,'Contributions calculator'!D7=68),2,\"\")","v":""},null,null,null,null,"P66","Regular conts for personal AP of £250 with PNPA 66",{"$f":"INDEX('NRA66'!$W$6:$AQ$58,MATCH('Contributions calculator'!$D$11,'NRA66'!$W$6:$W$58,0),MATCH('Contributions calculator'!$D$21,'NRA66'!$W$6:$AQ$6,0))","v":{"$error":"#N/A"}}]
[null,null,{"$f":"IF(OR('Contributions calculator'!D7=68),3,\"\")","v":""},null,null,null,null,"P67","Regular conts for personal AP of £250 with PNPA 67",{"$f":"INDEX('NRA67'!$W$6:$AQ$58,MATCH('Contributions calculator'!$D$11,'NRA67'!$W$6:$W$58,0),MATCH('Contributions calculator'!$D$21,'NRA67'!$W$6:$AQ$6,0))","v":{"$error":"#N/A"}}]
{"$rows_left_out":222}
{"sheet":"State pension age","index":4,"n_rows":42,"n_cols":13,"rows_kept":42,"cut":false,"hidden":true,"merged":[]}
[]
[null,null,null,"SPA"]
[null,"Date of birth","Total whole Months","Years","Months- altair rounding-up","Months","Days","DOB from",null,"DOB to","SPA date"]
[null,{"$f":"IF('Contributions calculator'!$D$4<H5,'Contributions calculator'!$D$4,\"\")","v":"00:00:00"},null,65]
["Increase from 65 to 66",{"$f":"IF(AND('Contributions calculator'!$D$4>=H5,'Contributions calculator'!$D$4<=J5),'Contributions calculator'!$D$4,\"\")","v":""},{"$f":"IF(B5=\"\",\"\",IF(DAY(K5)>=DAY(B5),0,-1)+(YEAR(K5)-YEAR(B5))*12+MONTH(K5)-MONTH(B5))","v":""},{"$f":"IF(B5=\"\",\"\",ROUNDDOWN(C5/12,0))","v":""},{"$f":"IF(OR(G5=\"\",G5=0),F5,F5+1)","v":""},{"$f":"IF(B5=\"\",\"\",C5-(65*12))","v":""},{"$f":"IF(B5=\"\",\"\",K5-M5)","v":""},"1953-12-06",null,"1954-01-05","2019-03-06",null,{"$f":"IF(B5=\"\",\"\",DATE(YEAR(B5)+65,MONTH(B5)+F5,DAY(B5)))","v":""}]
[null,{"$f":"IF(AND('Contributions calculator'!$D$4>=H6,'Contributions calculator'!$D$4<=J6),'Contributions calculator'!$D$4,\"\")","v":""},"",{"$f":"IF(B6=\"\",\"\",ROUNDDOWN(C6/12,0))","v":""},{"$f":"IF(OR(G6=\"\",G6=0),F6,F6+1)","v":""},{"$f":"IF(B6=\"\",\"\",C6-(65*12))","v":""},{"$f":"IF(B6=\"\",\"\",K6-M6)","v":""},"1954-01-06",null,"1954-02-05","2019-05-06",null,""]
[null,{"$f":"IF(AND('Contributions calculator'!$D$4>=H7,'Contributions calculator'!$D$4<=J7),'Contributions calculator'!$D$4,\"\")","v":""},"","","","","","1954-02-06",null,"1954-03-05","2019-07-06",null,""]
[null,{"$f":"IF(AND('Contributions calculator'!$D$4>=H8,'Contributions calculator'!$D$4<=J8),'Contributions calculator'!$D$4,\"\")","v":""},"","","","","","1954-03-06",null,"1954-04-05","2019-09-06",null,""]
[null,{"$f":"IF(AND('Contributions calculator'!$D$4>=H9,'Contributions calculator'!$D$4<=J9),'Contributions calculator'!$D$4,\"\")","v":""},"","","","","","1954-04-06",null,"1954-05-05","2019-11-06",null,""]
[null,{"$f":"IF(AND('Contributions calculator'!$D$4>=H10,'Contributions calculator'!$D$4<=J10),'Contributions calculator'!$D$4,\"\")","v":""},"","","","","","1954-05-06",null,"1954-06-05","2020-01-06",null,""]
{"$rows_left_out":33}
{"sheet":"Lump Sum","index":5,"n_rows":56,"n_cols":20,"rows_kept":56,"cut":false,"hidden":true,"merged":[[4,13,4,15],[7,14,7,15],[4,17,4,19],[7,18,7,19],[7,10,7,11],[7,2,7,3],[7,6,7,7],[4,1,4,3],[4,5,4,7],[4,9,4,11]]}
[null,null,null,null,null,null,"Lump Sum Elections",null,null,"Date Factors Issued to Client","2023-10-17"]
[]
[null,"x-701",null,null,null,"x-702",null,null,null,"x-703",null,null,null,"x-704",null,null,null,"x-705"]
[]
[null,"Table APS60: NPA 60, STSS",null,null,null,"Table APS65: NPA 65, STSS and STPS",null,null,null,"Table APS66: NPA 66, STPS",null,null,null,"Table APS67: NPA 67, STPS",null,null,null,"Table APS68: NPA 68, STPS"]
[]
[null,"Benefits","Personal","Personal and dependant's",null,"Benefits","Personal","Personal and dependant's",null,"Benefits","Personal","Personal and dependant's",null,"Benefits","Personal","Personal and dependant's",null,"Benefits","Personal","Personal and dependant's"]
[null,"Age when notice of election given","Single premium to purchase £250 of APB at date of election, £",null,null,"Age when notice of election given","Single premium to purchase £250 of APB at date of election, £",null,null,"Age when notice of election given","Single premium to purchase £250 of AP at date of election, £",null,null,"Age when notice of election given","Single premium to purchase £250 of AP at date of election, £",null,null,"Age when notice of election given","Single premium to purchase £250 of AP at date of election, £"]
[null,20,null,null,null,20,2510,2720,null,20,2400,2620,null,20,2300,2520,null,20,2210,2420]
[null,21,null,null,null,21,2550,2760,null,21,2440,2660,null,21,2340,2550,null,21,2240,2450]
{"$rows_left_out":47}
{"sheet":"NRA60","index":6,"n_rows":55,"n_cols":43,"rows_kept":55,"cut":false,"hidden":true,"merged":[[4,1,4,20],[4,23,4,42]]}
[null,null,null,null,null,null,null,null,null,null,null,null,null,null,null,null,null,null,null,null,"Date Factors Issued to Client","2023-10-17"]
["Regular Contribution Elections made after 31 March 2011",null,null,null,null,null,null,null,null,null,null,null,null,null,null,null,null,null,null,null,null,null,"Regular Contribution Elections made after 31 March 2011"]
["Table D60: Personal and Dependant's Benefits, NRA 60",null,null,null,null,null,null,null,null,null,null,"x-707",null,null,null,null,null,null,null,null,null,null,"Table P60: Personal Benefits, NRA 60 ",null,null,null,null,null,null,"x-706"]
[]
["Age when notice of election given\nâ","Monthly contribution to purchase £250 of APB at date of election, £",null,null,null,null,null,null,null,null,null,null,null,null,null,null,null,null,null,null,null,null,"Age when notice of election given\nâ","Monthly contribution to purchase £250 of APB at date of election, £"]
["Payment period (in years) à",1,2,3,4,5,6,7,8,9,10,11,12,13,14,15,16,17,18,19,20,null,"Payment period (in years) à",1,2,3,4,5,6,7,8,9,10,11,12,13,14,15,16,17,18,19,20]
[16,null,null,null,null,null,null,null,null,null,null,null,null,null,null,null,null,null,null,null,null,null,16]
[17,null,null,null,null,null,null,null,null,null,null,null,null,null,null,null,null,null,null,null,null,null,17]
[18,null,null,null,null,null,null,null,null,null,null,null,null,null,null,null,null,null,null,null,null,null,18]
[19,null,null,null,null,null,null,null,null,null,null,null,null,null,null,null,null,null,null,null,null,null,19]
{"$rows_left_out":46}
{"sheet":"NRA65","index":7,"n_rows":55,"n_cols":43,"rows_kept":55,"cut":false,"hidden":true,"merged":[[4,1,4,20],[4,23,4,42]]}
[null,null,null,null,null,null,null,null,null,null,null,null,null,null,null,null,null,null,null,null,"Date Factors Issued to Client","2023-10-17"]
["Regular Contribution Elections",null,null,null,null,null,null,null,null,null,null,null,null,null,null,null,null,null,null,null,null,null,"Regular Contribution Elections"]
["Table D65: Personal and Dependant’s Benefits, NRA 65",null,null,null,null,null,null,null,null,null,"x-709",null,null,null,null,null,null,null,null,null,null,null,"Table P65: Personal Benefits, NRA 65 ",null,null,null,null,null,null,null,null,null,null,"x-708"]
[]
["Age when notice of election given\nâ","Monthly contribution to purchase £250 of APB at date of election, £",null,null,null,null,null,null,null,null,null,null,null,null,null,null,null,null,null,null,null,null,"Age when notice of election given\nâ","Monthly contribution to purchase £250 of APB at date of election, £"]
["Payment period (in years) à",1,2,3,4,5,6,7,8,9,10,11,12,13,14,15,16,17,18,19,20,null,"Payment period (in years) à",1,2,3,4,5,6,7,8,9,10,11,12,13,14,15,16,17,18,19,20]
[16,null,null,null,null,null,null,null,null,null,null,null,null,null,null,null,null,null,null,null,null,null,16]
[17,null,null,null,null,null,null,null,null,null,null,null,null,null,null,null,null,null,null,null,null,null,17]
[18,null,null,null,null,null,null,null,null,null,null,null,null,null,null,null,null,null,null,null,null,null,18]
[19,null,null,null,null,null,null,null,null,null,null,null,null,null,null,null,null,null,null,null,null,null,19]
{"$rows_left_out":46}
{"sheet":"NRA66","index":8,"n_rows":56,"n_cols":43,"rows_kept":56,"cut":false,"hidden":true,"merged":[[4,1,4,20],[4,23,4,42]]}
[null,null,null,null,null,null,null,null,null,null,null,null,null,null,null,null,null,null,null,null,"Date Factors Issued to Client","2023-10-17"]
["Regular Contribution Elections",null,null,null,null,null,null,null,null,null,null,null,null,null,null,null,null,null,null,null,null,null,"Regular Contribution Elections"]
["Table D66: Personal and Dependant’s Benefits, NRA 66",null,null,null,null,null,null,null,null,"x-711",null,null,null,null,null,null,null,null,null,null,null,null,"Table P66: Personal Benefits, NRA 66 ",null,null,null,null,null,"x-710"]
[]
["Age when notice of election given\nâ","Monthly contribution to purchase £250 of APB at date of election, £",null,null,null,null,null,null,null,null,null,null,null,null,null,null,null,null,null,null,null,null,"Age when notice of election given\nâ","Monthly contribution to purchase £250 of APB at date of election, £"]
["Payment period (in years) à",1,2,3,4,5,6,7,8,9,10,11,12,13,14,15,16,17,18,19,20,null,"Payment period (in years) à",1,2,3,4,5,6,7,8,9,10,11,12,13,14,15,16,17,18,19,20]
[16,null,null,null,null,null,null,null,null,null,null,null,null,null,null,null,null,null,null,null,null,null,16]
[17,null,null,null,null,null,null,null,null,null,null,null,null,null,null,null,null,null,null,null,null,null,17]
[18,null,null,null,null,null,null,null,null,null,null,null,null,null,null,null,null,null,null,null,null,null,18]
[19,null,null,null,null,null,null,null,null,null,null,null,null,null,null,null,null,null,null,null,null,null,19]
{"$rows_left_out":47}
{"sheet":"NRA67","index":9,"n_rows":57,"n_cols":43,"rows_kept":57,"cut":false,"hidden":true,"merged":[[4,1,4,20],[4,23,4,42]]}
[null,null,null,null,null,null,null,null,null,null,null,null,null,null,null,null,null,null,null,null,"Date Factors Issued to Client","2023-10-17"]
["Regular Contribution Elections",null,null,null,null,null,null,null,null,null,null,null,null,null,null,null,null,null,null,null,null,null,"Regular Contribution Elections"]
["Table D67: Personal and Dependant’s Benefits, NRA 67",null,null,null,null,null,null,null,null,"x-713",null,null,null,null,null,null,null,null,null,null,null,null,"Table P67: Personal Benefits, NRA 67 ",null,null,null,null,null,null,null,"x-712"]
[]
["Age when notice of election given\nâ","Monthly contribution to purchase £250 of APB at date of election, £",null,null,null,null,null,null,null,null,null,null,null,null,null,null,null,null,null,null,null,null,"Age when notice of election given\nâ","Monthly contribution to purchase £250 of APB at date of election, £"]
["Payment period (in years) à",1,2,3,4,5,6,7,8,9,10,11,12,13,14,15,16,17,18,19,20,null,"Payment period (in years) à",1,2,3,4,5,6,7,8,9,10,11,12,13,14,15,16,17,18,19,20]
[16,null,null,null,null,null,null,null,null,null,null,null,null,null,null,null,null,null,null,null,null,null,16]
[17,null,null,null,null,null,null,null,null,null,null,null,null,null,null,null,null,null,null,null,null,null,17]
[18,null,null,null,null,null,null,null,null,null,null,null,null,null,null,null,null,null,null,null,null,null,18]
[19,null,null,null,null,null,null,null,null,null,null,null,null,null,null,null,null,null,null,null,null,null,19]
{"$rows_left_out":48}
{"sheet":"NRA68","index":10,"n_rows":58,"n_cols":43,"rows_kept":58,"cut":false,"hidden":true,"merged":[[4,1,4,20],[4,23,4,42]]}
[]
["Regular Contribution Elections",null,null,null,null,null,null,null,null,null,null,null,null,null,null,null,null,null,null,null,null,null,"Regular Contribution Elections"]
["Table D68: Personal and Dependant’s Benefits, NRA 68",null,null,null,null,null,null,null,"x-715",null,null,null,null,null,null,null,null,null,null,null,null,null,"Table P68: Personal Benefits, NRA 68 ",null,null,null,null,null,"x-714"]
[]
["Age when notice of election given\nâ","Monthly contribution to purchase £250 of APB at date of election, £",null,null,null,null,null,null,null,null,null,null,null,null,null,null,null,null,null,null,null,null,"Age when notice of election given\nâ","Monthly contribution to purchase £250 of APB at date of election, £"]
["Payment period (in years) à",1,2,3,4,5,6,7,8,9,10,11,12,13,14,15,16,17,18,19,20,null,"Payment period (in years) à",1,2,3,4,5,6,7,8,9,10,11,12,13,14,15,16,17,18,19,20]
[16,null,null,null,null,null,null,null,null,null,null,null,null,null,null,null,null,null,null,null,null,null,16]
[17,null,null,null,null,null,null,null,null,null,null,null,null,null,null,null,null,null,null,null,null,null,17]
[18,null,null,null,null,null,null,null,null,null,null,null,null,null,null,null,null,null,null,null,null,null,18]
[19,null,null,null,null,null,null,null,null,null,null,null,null,null,null,null,null,null,null,null,null,null,19]
{"$rows_left_out":49}
{"sheet":"ERF","index":11,"n_rows":25,"n_cols":16,"rows_kept":25,"cut":false,"hidden":true,"merged":[[1,0,1,13],[2,0,2,13],[3,0,3,13],[4,0,4,13],[5,0,5,12]]}
[null,null,null,null,null,null,null,null,null,null,null,null,"Date Factors Issued to Client","2023-06-30"]
["TABLE ERF1_NHSSS_2015"]
["NHS SUPERANNUATION SCHEME SCOTLAND (2015): ACTUARIAL FACTORS"]
["BENEFITS PAYABLE TO THE MEMBER ON VOLUNTARY EARLY RETIREMENT (WITH ACTUARIAL REDUCTION)"]
["FACTORS APPLICABLE TO MAIN SCHEME PENSION AND ADDITIONAL PENSION"]
["PENSION FACTORS",null,null,null,null,null,null,null,null,null,null,null,null,null,null,"x-408"]
["Time to NPA: Monthsà\nYears â",0,1,2,3,4,5,6,7,8,9,10,11]
[0,1,0.998,0.99299999999999999,0.98899999999999999,0.98399999999999999,0.98,0.97599999999999998,0.97099999999999997,0.96699999999999997,0.96199999999999997,0.95799999999999996,0.95299999999999996]
[1,0.94899999999999995,0.94499999999999995,0.94099999999999995,0.93700000000000006,0.93300000000000005,0.92900000000000005,0.92400000000000004,0.92,0.91600000000000004,0.91200000000000003,0.90800000000000003,0.90400000000000003]
[2,0.9,0.89600000000000002,0.89300000000000002,0.88900000000000001,0.88500000000000001,0.88100000000000001,0.878,0.874,0.87,0.86699999999999999,0.86299999999999999,0.85899999999999999]
{"$rows_left_out":15}