{"text_format":"1","workbook":"xlsx","n_sheets":3,"sheets":["Results","Teachers Non Club Factors","STPS STSS Non Club Factors"],"not_rendered":{"charts":0,"images":0,"macros":1,"external_links":2,"defined_names":49,"comments":0,"pivot_tables":0},"unopened":[],"bounds":{"document_bytes":16777216,"sheet_cells":100000,"rows_first":2000,"rows_last":500,"rows_between":2000,"halvings":0,"cell_chars":16384,"cell_head_chars":4096},"cells_cut":0,"cells_raw":0,"read":"whole","date_system":"1900"}

{"sheet":"Results","index":0,"n_rows":52,"n_cols":44,"rows_kept":52,"cut":false,"hidden":false,"merged":[[11,16,11,17],[35,1,35,2],[38,21,38,22],[30,13,31,17],[30,6,30,8],[31,1,31,2],[42,19,42,20],[42,21,42,22],[38,19,38,20],[39,19,39,20],[40,19,40,20],[35,3,35,4],[33,9,33,10],[34,9,34,10],[37,2,38,6],[30,1,30,2],[16,9,16,10],[14,9,14,10],[13,6,13,8],[12,6,12,10],[13,9,13,10],[27,1,27,3],[18,1,18,2],[17,1,17,2],[42,26,42,27],[10,20,10,21],[35,9,35,10],[33,1,33,2],[34,1,34,2],[32,2,32,3],[31,6,31,8],[31,9,31,10],[31,3,31,4],[35,6,35,8],[34,6,34,8],[33,6,33,8],[28,9,28,10],[19,3,19,4],[19,1,19,2],[17,6,17,8],[17,9,17,10],[21,3,21,4],[21,1,21,2],[42,2,42,5],[30,9,30,10],[30,3,30,4],[33,3,33,4],[34,3,34,4],[40,26,40,27],[41,2,41,5],[39,21,39,22],[40,21,40,22],[29,1,29,2],[18,3,18,4],[27,6,27,8],[18,9,18,10],[20,1,20,2],[20,3,20,4],[26,1,26,2],[24,1,24,2],[12,1,12,4],[29,6,29,8],[28,6,28,8],[29,9,29,10],[29,3,29,4],[26,6,26,8],[28,3,28,4],[25,6,25,8],[26,9,26,10],[25,9,25,10],[22,1,22,2],[22,3,22,4],[4,9,4,10],[6,9,6,10],[6,6,6,8],[7,6,7,8],[9,1,9,4],[7,19,7,22],[7,9,7,10],[9,19,9,22],[6,19,6,22],[44,19,44,20],[44,21,44,22],[43,19,43,20],[0,19,0,20],[1,19,1,20],[2,19,2,20],[26,3,26,4],[14,1,14,2],[13,3,13,4],[13,1,13,2],[14,3,14,4],[4,1,4,2],[5,1,5,2],[7,1,7,2],[6,1,6,2],[24,3,24,4],[17,3,17,4],[16,1,16,2],[16,3,16,4],[2,0,3,11],[3,19,3,22],[10,1,11,4],[10,6,11,10],[43,21,43,22],[17,43,17,54],[24,43,24,79],[0,0,1,11],[23,3,23,4],[23,1,23,2],[11,14,11,15],[16,6,16,8],[18,6,18,8],[4,26,4,27],[14,6,14,8],[4,19,4,22],[4,3,4,4],[4,24,4,25],[10,15,10,16],[8,1,8,2],[4,6,4,8],[5,3,5,4],[11,24,13,24],[11,21,11,22],[11,19,11,20],[6,3,6,4],[7,3,7,4],[5,19,5,22],[8,6,9,10],[51,1,51,7],[51,9,51,10],[48,1,48,7],[47,1,47,7],[39,6,39,8],[40,6,40,8],[41,6,41,8],[42,6,42,8],[43,6,43,8],[44,6,44,8],[45,6,45,8],[50,9,50,10],[50,1,50,7],[49,1,49,7],[47,9,47,10],[48,9,48,10],[49,9,49,10],[39,2,39,5],[40,2,40,5],[43,2,43,5],[44,2,44,5],[45,2,45,5]]}
["Teachers Pension Scheme(s)",null,null,null,null,null,null,null,null,null,null,null,null,null,null,null,null,null,60,"NRA60",null,365,"M",{"$f":"(D15/V1)+B15","v":0},0.5,60,null,null,{"$f":"IF(Results!D5=\"NHS 1995 Section\",\"60\",IF(Results!D5=\"NHS 2008 Section\",\"65\"))","v":false}]
[null,null,null,null,null,null,null,null,null,null,null,null,null,null,null,null,null,null,80,"NRA65",null,122,"F",{"$f":"(J15/V1)+G15","v":0},0.375]
["Resource Account Calculator for Unprotected Members to 31/07/2023",null,null,null,null,null,null,null,null,null,null,null,null,null,null,null,null,null,null,"NHS 2015 Section"]
[]
[null," Final Salary Pension Scheme",null,"Choose",null,null," Inflation Rate",null,null,0.10100000000000001,null,null,null,null,{"$f":"B15+(D15/365)","v":0}]
[null," Name",null,null,null,null,null,null,null,null,null,null,null,null,{"$f":"IF(Results!D5=\"NHS 2008 Section\",\"60\",IF(Results!D5=\"NHS 1995 Section\",\"80\"))","v":false},null,null,null,null,null,null,null,null,null,null,null,null,null,null,null,null,null,null,null,null,null,null,null,null,null,null,null,"Quick Ref Key"]
[null," Gender",null,"Choose",null,null," Age at Start of Period",null,null,{"$f":"'Teachers Non Club Factors'!C111","v":122}]
[null," Date of Birth",null,null,null,null," Age at End of Period ",null,null,{"$f":"'Teachers Non Club Factors'!C122","v":123},null,null,null,null,null,null,null,null,null,null,null,null,null,null,null,null,null,null,null,null,null,null,null,null,null,null,null,null,null,null,null,null,1,"State Pension Age in Years & Months"]
[null," State Pension Age: Years, Months",null,0,0,1]
[null,null,null,null,null,null,null,null,null,null,null,null,null,null,null,null,null,null,null,null,null,null,null,null,null,null,null,null,null,null,null,null,null,null,null,null,null,null,null,null,null,null,2,"Final Salary Service @ 31/03/2015"]
[null,"Start of Period - 31/07/2022",null,null,null,null,"End of Period - 31/07/2023",null,null,null,null,null,null,null,null,"2016/2017",null,null,null,null,"2022/2023"]
[null,null,null,null,null,null,null,null,null,null,null,null,null,null,"Start",null,"End",null,null,"Start",null,"End",null,null,"Start adj inflation",null,null,null,null,null,null,null,null,null,null,null,null,null,null,null,null,null,3,"The actual pensionable earnings for 01/04/2015 - 31/03/2016"]
[null,"Final Salary Service",null,null,null,null,"Final Salary Service"]
[null,"Years",null,"Days",null,null,"Years",null,null,"Days",null,null,null,null,"FS","CARE","FS","CARE",null,"FS","CARE","FS","CARE","Difference",null,null,null,null,null,null,null,null,null,null,null,null,null,null,null,null,null,null,4,"The actual pensionable earnings for 01/04/2016 - 31/03/2017"]
[null,0,null,0,null,2,{"$f":"B15","v":0},null,null,{"$f":"D15","v":0},null,8,null,"Pension",null,null,null,null,null,{"$f":"IF(D5=T1,ROUND((D25/S2)*X1,2),ROUND((D25/S1)*X1,2))","v":0},{"$f":"AA45","v":0},{"$f":"IF(D5=T1,ROUND((J19/S2)*X2,2),ROUND((J19/S1)*X2,2))","v":0},{"$f":"AA46","v":0},{"$f":"(V15+W15)-(T15+U15)","v":0},{"$f":"(T15+U15)*J5","v":0},{"$f":"(T15+U15)+Y15","v":0}]
{"$rows_left_out":38}
{"sheet":"Teachers Non Club Factors","index":1,"n_rows":129,"n_cols":32,"rows_kept":129,"cut":false,"hidden":true,"merged":[[1,0,2,0],[1,8,2,8],[1,16,2,16],[1,24,2,24],[54,0,54,7],[54,8,54,15],[54,16,54,23],[54,24,54,30],[120,16,120,19],[121,0,121,1],[120,0,120,11],[109,12,109,15],[109,16,109,19],[110,0,110,1],[111,0,111,1],[112,0,112,1],[113,0,113,1],[109,0,109,11],[127,0,127,1],[114,0,114,1],[115,0,115,1],[116,0,116,1],[120,12,120,15],[122,0,122,1],[123,0,123,1],[124,0,124,1],[125,0,125,1],[126,0,126,1]]}
["Table TV2 – 1995 section: Males Normal Pension Age 60",null,null,null,null,null,null,null,"Table TV2 – 1995 section: Females Normal Pension Age 60",null,null,null,null,null,null,null,"Table TV3 – 2008 Section: Males Normal Pension Age 65",null,null,null,null,null,null,null,"Table TV4 – 2008 Section: Females Normal Pension Age 65 (up to age 59)"]
["Age last birthday at guarantee date","Pension Factor","Lump Sum Factor ","Surviving Partner's Pension Factor ","Male Deduction for GMP ","Deduction for NI Modification ","GMP Adj ",null,"Age last birthday at guarantee date","Pension Factor","Lump Sum Factor ","Surviving Partner's Pension Factor ","Female Deduction for GMP ","Deduction for NI Modification ","GMP Adj ",null,"Age last birthday at guarantee date","Pension Factor ","Lump Sum Factor (Choice Optants only)","Surviving Partner's Pension Factor ","Male Deduction for GMP ","Deduction for NI Modification  ","GMP Adj ",null,"Age last birthday at guarantee date","Pension Factor ","Lump Sum Factor \n(Choice Optants only) ","Surviving Partner's Pension Factor ","Female Deduction for Pre88 GMP","Female Deduction for Post88 GMP  ","Deduction for NI Modification  ","GMP Adj "]
[null,"(Factor A)","(Factor B)","(Factor C)","(Factor D)","(Factor F)","Factor",null,null,"(Factor A)","(Factor B)","(Factor C)","(Factor D)","(Factor F)",null,null,null,"(Factor A)","(Factor B)","(Factor C)","(Factor D)","(Factor E)","Factor",null,null,"(Factor A)","(Factor B)","(Factor C)","(Factor D)","(Factor †E)","(Factor E)","Factor"]
[18,7.26,0.35,0.66,3.63,5.18,0.15,null,18,7.26,0.35,0.66,3.1,5.18,0.15,null,18,6.5,0.33,0.76,3.66,4.6500000000000004,0.15,null,18,6.5,0.33,0.76,-0.67,-0.67,4.6500000000000004,3.5]
[19,7.26,0.35,0.66,3.63,5.18,0.15,null,19,7.26,0.35,0.66,3.1,5.18,0.15,null,19,6.64,0.34,0.8,3.65,4.78,0.15,null,19,6.64,0.34,0.8,-0.68,-0.68,4.78,3.5]
[20,7.26,0.35,0.66,3.63,5.18,0.15,null,20,7.26,0.35,0.66,3.1,5.18,0.15,null,20,6.78,0.35,0.82,3.64,4.91,0.15,null,20,6.78,0.35,0.82,-0.7,-0.7,4.91,3.5]
[21,7.26,0.35,0.66,3.63,5.18,0.15,null,21,7.26,0.35,0.66,3.1,5.18,0.15,null,21,6.93,0.36,0.84,3.64,5.04,0.15,null,21,6.93,0.36,0.84,-0.71,-0.71,5.04,3.5]
[22,8.93,0.41,0.84,3.63,5.18,0.15,null,22,8.93,0.41,0.84,3.1,5.18,0.15,null,22,7.07,0.36,0.86,3.63,5.18,0.15,null,22,7.07,0.36,0.86,-0.73,-0.73,5.18,3.5]
[23,9.1300000000000008,0.42,0.86,3.63,5.32,0.15,null,23,9.1300000000000008,0.42,0.86,3.09,5.32,0.15,null,23,7.22,0.37,0.88,3.63,5.32,0.15,null,23,7.22,0.37,0.88,-0.74,-0.74,5.32,3.5]
[24,9.33,0.43,0.88,3.62,5.46,0.15,null,24,9.33,0.43,0.88,3.09,5.46,0.15,null,24,7.38,0.38,0.9,3.62,5.46,0.15,null,24,7.38,0.38,0.9,-0.76,-0.76,5.46,3.5]
[25,9.5299999999999994,0.44,0.91,3.61,5.61,0.15,null,25,9.5299999999999994,0.44,0.91,3.08,5.61,0.15,null,25,7.53,0.39,0.92,3.61,5.61,0.15,null,25,7.53,0.39,0.92,-0.78,-0.78,5.61,3.5]
[26,9.74,0.45,0.93,3.61,5.77,0.15,null,26,9.74,0.45,0.93,3.08,5.77,0.15,null,26,7.69,0.4,0.94,3.61,5.77,0.15,null,26,7.69,0.4,0.94,-0.79,-0.79,5.77,3.5]
[27,9.9499999999999993,0.46,0.95,3.6,5.92,0.15,null,27,9.9499999999999993,0.46,0.95,3.07,5.92,0.15,null,27,7.85,0.41,0.96,3.6,5.92,0.15,null,27,7.85,0.41,0.96,-0.81,-0.81,5.92,3.5]
[28,10.16,0.47,0.97,3.59,6.08,0.15,null,28,10.16,0.47,0.97,3.07,6.08,0.15,null,28,8.02,0.42,0.99,3.59,6.08,0.15,null,28,8.02,0.42,0.99,-0.82,-0.82,6.08,3.5]
[29,10.38,0.49,0.99,3.59,6.25,0.15,null,29,10.38,0.49,0.99,3.06,6.25,0.15,null,29,8.19,0.43,1.01,3.59,6.25,0.15,null,29,8.19,0.43,1.01,-0.84,-0.84,6.25,3.5]
{"$rows_left_out":115}
{"sheet":"STPS STSS Non Club Factors","index":2,"n_rows":147,"n_cols":70,"rows_kept":147,"cut":false,"hidden":true,"merged":[[0,33,0,39],[0,42,0,48],[16,58,16,59],[16,60,16,61],[16,64,16,65],[11,34,11,36],[11,37,11,38],[11,43,11,45],[16,66,16,67],[16,68,16,69],[13,46,13,47],[14,46,14,47],[5,50,5,51],[11,46,11,47],[1,8,1,9],[1,10,1,11],[1,14,1,15],[1,16,1,17],[1,18,1,19],[1,22,1,23],[2,43,2,44],[2,22,2,23],[2,34,2,35],[2,50,3,58],[3,22,3,23],[4,22,4,23],[6,50,6,51],[7,50,7,51],[8,50,8,51],[8,52,9,58],[17,18,19,18],[13,37,13,38],[14,37,14,38],[16,19,16,25],[17,0,19,0],[17,1,19,1],[17,2,19,2],[17,3,19,3],[17,4,18,6],[17,7,19,7],[17,9,19,9],[17,10,19,10],[17,11,19,11],[17,12,19,12],[17,13,18,15],[17,16,19,16],[17,34,19,34],[17,36,19,36],[17,19,19,19],[17,20,19,20],[17,21,19,21],[17,22,18,24],[17,25,19,25],[17,27,19,27],[81,0,83,0],[81,1,83,1],[81,2,83,2],[81,3,83,3],[81,4,82,6],[81,13,82,15],[17,46,18,46],[17,47,18,47],[17,48,18,48],[17,49,18,49],[80,19,80,25],[17,37,19,37],[17,38,19,38],[17,39,19,39],[17,40,18,42],[17,43,19,43],[17,45,19,45],[17,28,19,28],[17,29,19,29],[17,30,19,30],[17,31,18,33],[81,7,83,7],[81,9,83,9],[81,10,83,10],[81,11,83,11],[81,12,83,12],[81,31,82,33],[81,16,83,16],[81,18,83,18],[81,19,83,19],[81,20,83,20],[81,21,83,21],[81,22,82,24],[81,25,83,25],[81,27,83,27],[81,28,83,28],[81,29,83,29],[81,30,83,30],[81,43,83,43],[81,34,83,34],[81,36,83,36],[81,37,83,37],[81,38,83,38],[81,39,83,39],[81,40,82,42]]}
[]
[null,"Age",null,{"$f":"INT((D4-D6)/365.25)","v":122},null,null,null,"Actual",2015,null,60,null,65,null,66,null,67,null,68,null,null,{"$f":"VLOOKUP(D9,AT21:AX76,2)","v":1.0129999999999999},"CPI + 1.25% pa"]
[null,"Gender",null,{"$f":"IF(Results!D7=\"M\", \"Male\",\"Female\")","v":"Female"},null,null,null,null,"Male","Female","Male 60","Female 60","Male 65","Female 65","Male ","Female ","Male ","Female ","Male ","Female ",null,{"$f":"VLOOKUP(D9,AT21:AX76,3)","v":1.0149999999999999},"CPI + 1.5% pa",null,null,"Male",null,60,65,66,67,68,null,null,"Inputs",null,null,null,null,null,null,null,null,"Inputs",null,null,null,null,null,null,"Interpolation formula"]
[null,"Relevant date",null,"2022-07-31",null,"Pension factor",null,{"$f":"IF(($D$3=\"Male\"),I4,J4)","v":false},{"$f":"IF($D$7=60,K4,IF($D$7=65,M4,IF($D$7=66,O4,IF($D$7=67,Q4,IF($D$7=68,S4)))))","v":false},false,{"$f":"VLOOKUP($D$2,a,2)","v":20.350000000000001},{"$f":"VLOOKUP($D$2,b,2)","v":20.350000000000001},{"$f":"VLOOKUP($D$2,e,2)","v":17.77},{"$f":"VLOOKUP($D$2,f,2)","v":17.77},{"$f":"VLOOKUP($D$2,g,2)","v":17.23},{"$f":"VLOOKUP($D$2,h,2)","v":17.23},{"$f":"VLOOKUP($D$2,j,2)","v":16.68},{"$f":"VLOOKUP($D$2,k,2)","v":16.68},{"$f":"VLOOKUP($D$2,q,2)","v":0},{"$f":"VLOOKUP($D$2,w,2)","v":16.12},null,{"$f":"VLOOKUP(D9,AT21:AX76,4)","v":1.016},"CPI + 1.6% pa",null,null,"Pension factor",null,{"$f":"VLOOKUP($D$2,a,2)","v":20.350000000000001},{"$f":"VLOOKUP($D$2,e,2)","v":17.77},{"$f":"VLOOKUP($D$2,g,2)","v":17.23},{"$f":"VLOOKUP($D$2,j,2)","v":16.68},{"$f":"VLOOKUP($D$2,q,2)","v":0},null,null,"DOB:",{"$f":"D6","v":"00:00:00"},null,null,null,null,null,null,null,"DOB:",{"$f":"Results!D8","v":"00:00:00"}]
[null,"NPA",null,{"$f":"IF(Results!D5=\"NRA60\",\"60\",\"65\")","v":"65"},null,"Lump sum factor",null,{"$f":"IF(($D$3=\"Male\"),I5,J5)","v":false},false,false,{"$f":"VLOOKUP($D$2,a,3)","v":0.99},{"$f":"VLOOKUP($D$2,b,3)","v":0.99},{"$f":"VLOOKUP($D$2,e,3)","v":0.99},{"$f":"VLOOKUP($D$2,f,3)","v":0.99},{"$f":"VLOOKUP($D$2,g,3)","v":0.99},{"$f":"VLOOKUP($D$2,h,3)","v":0.99},{"$f":"VLOOKUP($D$2,j,3)","v":0.99},{"$f":"VLOOKUP($D$2,f,3)","v":0.99},{"$f":"VLOOKUP($D$2,q,3)","v":0},{"$f":"VLOOKUP($D$2,w,3)","v":0.99},null,{"$f":"VLOOKUP(D9,AT21:AX76,5)","v":1.028},"Earnings",null,null,"Lump sum factor",null,{"$f":"VLOOKUP($D$2,a,3)","v":0.99},{"$f":"VLOOKUP($D$2,e,3)","v":0.99},{"$f":"VLOOKUP($D$2,g,3)","v":0.99},{"$f":"VLOOKUP($D$2,j,3)","v":0.99},{"$f":"VLOOKUP($D$2,q,3)","v":0},null,null,"Relevant date:",{"$f":"D4","v":"2022-07-31"},null,null,null,null,null,null,null,"Relevant date:",{"$f":"BB19","v":"2023-07-31"},null,null,null,null,null,null,"Fp(NPA67,2months =","Fp(NPA67)","+","{ 2 / 12","x","[Fp(NPA68)","-","Fp(NPA67)]}"]
[null,"DOB",null,{"$f":"Results!D8","v":"00:00:00"},null,"Widow(er)'s pension factor",null,false,false,false,{"$f":"VLOOKUP($D$2,a,4)","v":1.49},{"$f":"VLOOKUP($D$2,b,4)","v":1.49},{"$f":"VLOOKUP($D$2,e,4)","v":1.55},{"$f":"VLOOKUP($D$2,f,4)","v":1.55},{"$f":"VLOOKUP($D$2,g,4)","v":1.56},{"$f":"VLOOKUP($D$2,h,4)","v":1.56},{"$f":"VLOOKUP($D$2,j,4)","v":1.56},{"$f":"VLOOKUP($D$2,f,4)","v":1.55},{"$f":"VLOOKUP($D$2,q,4)","v":0},{"$f":"VLOOKUP($D$2,w,4)","v":1.57},null,null,null,null,null,"Widow(er)'s pension factor",null,{"$f":"VLOOKUP($D$2,a,4)","v":1.49},{"$f":"VLOOKUP($D$2,e,4)","v":1.55},{"$f":"VLOOKUP($D$2,g,4)","v":1.56},{"$f":"VLOOKUP($D$2,j,4)","v":1.56},{"$f":"VLOOKUP($D$2,q,4)","v":0},null,null,null,null,null,null,null,null,null,null,null,null,null,null,null,null,null,null,"=",null,8.19,"+","{ 2 / 12","x","[7.72","-","8.19]}"]
[null,"NRA",null,{"$f":"Results!D9","v":0},{"$f":"D7+1","v":1},"Pre-88 GMP factor",null,false,false,false,{"$f":"VLOOKUP($D$2,a,5)","v":3.39},{"$f":"VLOOKUP($D$2,b,5)","v":2.97},{"$f":"VLOOKUP($D$2,e,5)","v":3.51},{"$f":"VLOOKUP($D$2,f,5)","v":2.95},{"$f":"VLOOKUP($D$2,g,5)","v":2.9},{"$f":"VLOOKUP($D$2,h,5)","v":2.78},{"$f":"VLOOKUP($D$2,j,5)","v":2.73},{"$f":"VLOOKUP($D$2,f,5)","v":2.95},{"$f":"VLOOKUP($D$2,q,5)","v":0},{"$f":"VLOOKUP($D$2,w,5)","v":2.4500000000000002},null,null,null,null,null,"Pre-88 GMP factor",null,{"$f":"VLOOKUP($D$2,a,5)","v":3.39},{"$f":"VLOOKUP($D$2,e,5)","v":3.51},{"$f":"VLOOKUP($D$2,g,5)","v":2.9},{"$f":"VLOOKUP($D$2,j,5)","v":2.73},{"$f":"VLOOKUP($D$2,q,5)","v":0},null,null,"Relevant Age ",{"$f":"Results!J7","v":122},null,null,null,null,null,null,null,"Relevant Age ",{"$f":"Results!J8","v":123},null,null,null,null,null,"=",null,8.19,"+","{ 2 / 12","x","-0.47}"]
[null,"Factors",null,2018,null,"Post-88 GMP factor",null,false,false,false,{"$f":"VLOOKUP($D$2,a,6)","v":3.39},{"$f":"VLOOKUP($D$2,b,6)","v":2.97},{"$f":"VLOOKUP($D$2,e,6)","v":3.51},{"$f":"VLOOKUP($D$2,f,6)","v":0.03},{"$f":"VLOOKUP($D$2,g,6)","v":0},{"$f":"VLOOKUP($D$2,h,6)","v":0},{"$f":"VLOOKUP($D$2,j,6)","v":-0.02},{"$f":"VLOOKUP($D$2,f,6)","v":0.03},{"$f":"VLOOKUP($D$2,q,6)","v":0},{"$f":"VLOOKUP($D$2,w,6)","v":-0.05},null,null,null,null,null,"Post-88 GMP factor",null,{"$f":"VLOOKUP($D$2,a,6)","v":3.39},{"$f":"VLOOKUP($D$2,e,6)","v":3.51},{"$f":"VLOOKUP($D$2,g,6)","v":0},{"$f":"VLOOKUP($D$2,j,6)","v":-0.02},{"$f":"VLOOKUP($D$2,q,6)","v":0},null,null,null,null,null,null,null,null,null,null,null,null,null,null,null,null,null,null,"=",null,8.19,"+",-7.8333333333333283E-2]
[null,"Years to NPA",null,null,null,"NI Mod factor",null,false,false,false,{"$f":"VLOOKUP($D$2,a,8)","v":13.91},{"$f":"VLOOKUP($D$2,b,8)","v":15.02},{"$f":"VLOOKUP($D$2,e,8)","v":16.239999999999998},{"$f":"VLOOKUP($D$2,f,8)","v":17.46},{"$f":"VLOOKUP($D$2,g,8)","v":16.260000000000002},{"$f":"VLOOKUP($D$2,h,8)","v":17.5},{"$f":"VLOOKUP($D$2,j,8)","v":15.79},{"$f":"VLOOKUP($D$2,f,8)","v":17.46},{"$f":"VLOOKUP($D$2,q,8)","v":0},{"$f":"VLOOKUP($D$2,w,8)","v":16.57},null,null,null,null,null,null,null,null,null,null,null,null,null,null,null,"Years","Months",null,null,null,null,null,null,null,"Years","Months",null,null,null,null,"=",null,8.1116666666666699]
[null,"Revaluation","CPI + 1.6%",{"$f":"IF($C$10=\"CPI + 1.25%\",V2,IF($C$10=\"CPI + 1.5%\",V3,IF($C$10=\"CPI + 1.6%\",V4,IF($C$10=\"Earnings\",V5))))","v":1.016},null,"GMP Adjustment",null,false,false,false,{"$f":"VLOOKUP($D$2,a,7)","v":0.15},{"$f":"VLOOKUP($D$2,b,7)","v":0.15},{"$f":"VLOOKUP($D$2,e,7)","v":0.15},{"$f":"VLOOKUP($D$2,f,7)","v":3.5},{"$f":"VLOOKUP($D$2,g,7)","v":-0.1},{"$f":"VLOOKUP($D$2,h,7)","v":2},{"$f":"VLOOKUP($D$2,j,7)","v":-0.8},{"$f":"VLOOKUP($D$2,f,7)","v":3.5},{"$f":"VLOOKUP($D$2,q,7)","v":0},{"$f":"VLOOKUP($D$2,w,7)","v":1.5},null,null,null,null,null,null,null,null,null,null,null,null,null,null,"SPA:",{"$f":"Results!D9","v":0},{"$f":"Results!E9","v":0},null,null,null,null,null,null,"SPA:",{"$f":"Results!D9","v":0},{"$f":"Results!E9","v":0}]
[null,"Interpolated factor",null,{"$f":"IF(Results!E9>0,AL14,H4)","v":false},null,"Pension factor",null,{"$f":"IF(($D$3=\"Male\"),I11,J11)","v":false},{"$f":"IF($D$7=60,K11,IF($D$7=65,M11,IF($D$7=66,O11,IF($D$7=67,Q11,IF($D$7=68,S11)))))","v":false},false,{"$f":"M4","v":17.77},17.77,17.23,17.23,16.68,16.68,0,{"$f":"T4","v":16.12},null,null,null,null,null,null,null,"Female",null,60,65,66,67,68]
[null,null,null,0,null,"Lump sum factor",null,false,false,false,0.99,0.99,0.99,0.99,0.99,0.99,0,0.99,null,null,null,null,null,null,null,"Pension factor",null,{"$f":"VLOOKUP($D$2,b,2)","v":20.350000000000001},{"$f":"VLOOKUP($D$2,f,2)","v":17.77},{"$f":"VLOOKUP($D$2,h,2)","v":17.23},{"$f":"VLOOKUP($D$2,k,2)","v":16.68},{"$f":"VLOOKUP($D$2,w,2)","v":16.12},null,null,"Relevant factors table",null,null,"Interpolated ",null,null,null,null,null,"Relevant factors table",null,null,"Interpolated "]
[null,null,null,{"$f":"IF(Results!E9>0,AL15,H6)","v":false},null,"Widow(er)'s pension factor",null,false,false,false,1.55,1.55,1.56,1.56,1.56,1.55,0,1.57,null,null,null,null,null,null,null,"Lump sum factor",null,{"$f":"VLOOKUP($D$2,b,3)","v":0.99},{"$f":"VLOOKUP($D$2,f,3)","v":0.99},{"$f":"VLOOKUP($D$2,h,3)","v":0.99},{"$f":"VLOOKUP($D$2,k,3)","v":0.99},{"$f":"VLOOKUP($D$2,w,3)","v":0.99},null,null,"NPA",{"$f":"D7","v":0},{"$f":"E7","v":1},{"$f":"Results!D9","v":0},{"$f":"Results!E9","v":0},null,{"$f":"AK10/12","v":0},{"$f":"AK10/12","v":0},null,"NPA",{"$f":"D7","v":0},{"$f":"E7","v":1},{"$f":"Results!D9","v":0},{"$f":"Results!E9","v":0},null,{"$f":"AT10/12","v":0},{"$f":"AT10/12","v":0}]
[null,null,null,null,null,"Pre-88 GMP factor",null,{"$f":"IF(($D$3=\"Male\"),I14,J14)","v":false},{"$f":"IF($D$7=60,K14,IF($D$7=65,M14,IF($D$7=66,O14,IF($D$7=67,Q14,IF($D$7=68,S15)))))","v":false},{"$f":"IF($D$7=60,L14,IF($D$7=65,N14,IF($D$7=66,P14,IF($D$7=67,R14,IF($D$7=68,T15)))))","v":false},3.51,2.95,2.9,2.78,2.73,2.95,0,2.4500000000000002,null,null,null,null,null,null,null,null,null,null,null,null,null,null,null,null,"Fp",{"$f":"H4","v":false},{"$f":"H11","v":false},{"$f":"AJ14+AO15","v":0},null,null,{"$f":"AK14-AJ14","v":0},{"$f":"AK15-AJ15","v":0},null,"Fp",{"$f":"BF19","v":false},{"$f":"BF26","v":false},{"$f":"AS14+AX15","v":0},null,null,{"$f":"AT14-AS14","v":0},{"$f":"AT15-AS15","v":0}]
[null,null,null,null,null,"Post-88 GMP factor",null,{"$f":"IF(($D$3=\"Male\"),I15,J15)","v":false},{"$f":"IF($D$7=60,K15,IF($D$7=65,M15,IF($D$7=66,O15,IF($D$7=67,Q15,IF($D$7=68,S16)))))","v":false},{"$f":"IF($D$7=60,L15,IF($D$7=65,N15,IF($D$7=66,P15,IF($D$7=67,R15,IF($D$7=68,T16)))))","v":false},3.51,0.03,0,0,-0.02,0.03,0,-0.05,null,null,null,null,null,null,null,"Widow(er)'s pension factor",null,{"$f":"VLOOKUP($D$2,b,4)","v":1.49},{"$f":"VLOOKUP($D$2,f,4)","v":1.55},{"$f":"VLOOKUP($D$2,h,4)","v":1.56},{"$f":"VLOOKUP($D$2,k,4)","v":1.56},{"$f":"VLOOKUP($D$2,w,4)","v":1.57},null,null,"Wid",{"$f":"H6","v":false},{"$f":"H13","v":false},{"$f":"AP15+AJ15","v":0},null,null,{"$f":"AO13*AO14","v":0},{"$f":"AP13*AP14","v":0},null,"Wid",{"$f":"BF21","v":false},{"$f":"BF28","v":false},{"$f":"AY15+AS15","v":0},null,null,{"$f":"AX13*AX14","v":0},{"$f":"AY13*AY14","v":0}]
{"$rows_left_out":132}