{"text_format":"1","workbook":"xlsx","n_sheets":3,"sheets":["Results","NHS FS Non Club Factors","NHS CARE Non Club Factors"],"not_rendered":{"charts":0,"images":1,"macros":1,"external_links":2,"defined_names":39,"comments":0,"pivot_tables":0},"unopened":[],"bounds":{"document_bytes":16777216,"sheet_cells":100000,"rows_first":2000,"rows_last":500,"rows_between":2000,"halvings":0,"cell_chars":16384,"cell_head_chars":4096},"cells_cut":0,"cells_raw":0,"read":"whole","date_system":"1900"}

{"sheet":"Results","index":0,"n_rows":49,"n_cols":45,"rows_kept":49,"cut":false,"hidden":false,"merged":[[46,10,46,11],[39,25,43,26],[39,20,39,21],[35,22,35,23],[27,14,28,18],[3,1,4,12],[27,7,27,9],[28,2,28,3],[20,44,20,55],[22,44,22,80],[35,20,35,21],[36,20,36,21],[37,20,37,21],[5,27,5,28],[5,25,5,26],[11,16,11,17],[12,25,14,25],[12,22,12,23],[12,20,12,21],[6,20,6,23],[7,20,7,23],[7,10,7,11],[7,7,7,9],[8,7,8,9],[1,1,2,12],[48,2,48,8],[48,10,48,11],[45,2,45,8],[44,2,44,8],[36,7,36,9],[37,7,37,9],[38,7,38,9],[39,7,39,9],[40,7,40,9],[41,7,41,9],[42,7,42,9],[47,10,47,11],[47,2,47,8],[46,2,46,8],[44,10,44,11],[45,10,45,11],[32,2,32,3],[9,2,9,3],[5,7,5,9],[6,4,6,5],[7,4,7,5],[8,4,8,5],[5,10,5,11],[1,20,1,21],[2,20,2,21],[3,20,3,21],[23,4,23,5],[15,2,15,3],[14,4,14,5],[14,2,14,3],[15,4,15,5],[5,2,5,3],[6,2,6,3],[8,2,8,3],[7,2,7,3],[21,4,21,5],[18,4,18,5],[17,2,17,3],[17,4,17,5],[4,20,4,23],[11,2,12,5],[11,7,12,11],[9,7,10,11],[12,15,12,16],[15,7,15,9],[5,20,5,23],[5,4,5,5],[17,7,17,9],[18,7,18,9],[27,10,27,11],[10,2,10,5],[12,17,12,18],[26,2,26,3],[18,2,18,3],[23,2,23,3],[21,2,21,3],[13,2,13,5],[17,10,17,11],[15,10,15,11],[14,7,14,9],[13,7,13,11],[14,10,14,11],[24,2,24,4],[19,2,19,3],[19,4,19,5],[24,7,24,9],[26,7,26,9],[25,7,25,9],[26,10,26,11],[39,24,40,24],[39,27,40,27],[38,3,38,6],[39,3,39,6],[40,3,40,6],[41,3,41,6],[8,10,8,11],[26,4,26,5],[23,7,23,9],[8,20,8,23],[11,21,11,22],[32,10,32,11],[30,2,30,3],[31,2,31,3],[29,3,29,4],[28,7,28,9],[28,10,28,11],[28,4,28,5],[32,7,32,9],[31,7,31,9],[30,7,30,9],[25,10,25,11],[25,4,25,5],[22,7,22,9],[42,3,42,6],[10,20,10,23],[40,22,40,23],[41,20,41,21],[41,22,41,23],[40,20,40,21],[36,3,36,6],[37,3,37,6],[32,4,32,5],[30,10,30,11],[31,10,31,11],[34,3,35,7],[27,2,27,3],[20,2,20,3],[20,4,20,5],[36,22,36,23],[37,22,37,23],[39,22,39,23],[27,4,27,5],[30,4,30,5],[31,4,31,5],[23,10,23,11],[22,10,22,11],[18,10,18,11]]}
[]
[null,"NHS Pension Scheme(s)",null,null,null,null,null,null,null,null,null,null,null,null,null,null,null,null,null,60,"NHS 1995 Section",null,365,"M",{"$f":"(E16/W2)+C16","v":0},0.5,60,null,null,{"$f":"IF(Results!E6=\"NHS 1995 Section\",\"60\",IF(Results!E6=\"NHS 2008 Section\",\"65\"))","v":false}]
[null,null,null,null,null,null,null,null,null,null,null,null,null,null,null,null,null,null,null,80,"NHS 2008 Section",null,122,"F",{"$f":"(K16/W2)+H16","v":0},0.375]
[null,"Resource Account Calculator for Unprotected Members to 31/03/2020",null,null,null,null,null,null,null,null,null,null,null,null,null,null,null,null,null,null,"NHS 2015 Section"]
[]
[null,null," Final Salary Pension Scheme",null,"Choose",null,null," Inflation Rate",null,null,1.7000000000000001E-2,null,null,null,null,{"$f":"C16+(E16/365)","v":0}]
[null,null," Name",null,null,null,null,null,null,null,null,null,null,null,null,{"$f":"IF(Results!E6=\"NHS 2008 Section\",\"60\",IF(Results!E6=\"NHS 1995 Section\",\"80\"))","v":false},null,null,null,null,null,null,null,null,null,null,null,null,null,null,null,null,null,null,null,null,null,null,null,null,null,null,null,"Quick Ref Key"]
[null,null," Gender",null,"Choose",null,null," Age at Start of Period",null,null,{"$f":"'NHS FS Non Club Factors'!C112","v":119}]
[null,null," Date of Birth",null,null,null,null," Age at End of Period ",null,null,{"$f":"'NHS FS Non Club Factors'!C123","v":120},null,null,null,null,null,null,null,null,null,null,null,null,null,null,null,null,null,null,null,null,null,null,null,null,null,null,null,null,null,null,null,null,1,"State Pension Age in Years & Months"]
[null,null," State Pension Age: Years, Months",null,0,0,1]
[null,null,null,null,null,null,null,null,null,null,null,null,null,null,null,null,null,null,null,null,null,null,null,null,null,null,null,null,null,null,null,null,null,null,null,null,null,null,null,null,null,null,null,2,"Final Salary Service @ 31/03/2015"]
[null,null,"Start Period - 31/03/2019",null,null,null,null,"End Period - 31/03/2020",null,null,null,null,null,null,null,null,"2016/2017",null,null,null,null,"2019/2020"]
[null,null,null,null,null,null,null,null,null,null,null,null,null,null,null,"Start",null,"End",null,null,"Start",null,"End",null,null,"Start adj inflation",null,null,null,null,null,null,null,null,null,null,null,null,null,null,null,null,null,3,"The actual pensionable earnings for 01/04/2015 - 31/03/2016"]
[null,null,"Final Salary Service",null,null,null,null,"Final Salary Service"]
[null,null,"Years",null,"Days",null,null,"Years",null,null,"Days",null,null,null,null,"FS","CARE","FS","CARE",null,"FS","CARE","FS","CARE","Difference",null,null,null,null,null,null,null,null,null,null,null,null,null,null,null,null,null,null,4,"The actual pensionable earnings for 01/04/2016 - 31/03/2017"]
[null,null,0,null,0,null,2,{"$f":"C16","v":0},null,null,{"$f":"E16","v":0},null,8,null,"Pension",null,null,null,null,null,{"$f":"IF(E6=U2,ROUND((E22/T3)*Y2,2),ROUND((E22/T2)*Y2,2))","v":0},{"$f":"AA38","v":0},{"$f":"IF(E6=U2,ROUND((K19/T3)*Y3,2),ROUND((K19/T2)*Y3,2))","v":0},{"$f":"AA39","v":0},{"$f":"(W16+X16)-(U16+V16)","v":0},{"$f":"(U16+V16)*K6","v":0},{"$f":"(U16+V16)+Z16","v":0}]
[null,null,null,null,null,null,null,null,null,null,null,null,null,null,"Lump Sum",null,null,null,null,null,{"$f":"IF(E6=U2,(U16*3),0)","v":0},null,{"$f":"IF(E6=U2,(W16*3),0)","v":0},null,{"$f":"(W17+X17)-(U17+V17)","v":0},{"$f":"(U17+V17)*K6","v":0},{"$f":"(U17+V17)+Z17","v":0},null,null,null,null,null,null,null,null,null,null,null,null,null,null,null,null,5,"The actual pensionable earnings for 01/04/2017 - 31/03/2018"]
[null,null," 15/16 CARE Actual Earnings",null,0,null,3," 19/20 CARE Actual Earnings",null,null,0,null,9,null,"Spouse",null,null,null,null,null,{"$f":"IF(E6=U2,(U16*Z2),(U16*Z3))","v":0},{"$f":"V16*0.3375","v":0},{"$f":"IF(E6=U2,(W16*Z2),(W16*Z3))","v":0},{"$f":"X16*0.3375","v":0},{"$f":"(W18+X18)-(U18+V18)","v":0}]
[null,null," 16/17 CARE Actual Earnings ",null,0,null,4," 19/20 WTE Final Salary Link Pay",null,null,0,null,9,null,null,null,null,null,null,null,null,null,null,null,null,null,null,null,null,null,null,null,null,null,null,null,null,null,null,null,null,null,null,6,"The actual pensionable earnings for 01/04/2018 - 31/03/2019"]
[null,null," 17/18 CARE Actual Earnings",null,0,null,5,null,null,null,null,null,null,null,"Factors",null,null,null,null,null,null,null,null," "]
[null,null," 18/19 CARE Actual Earnings",null,0,null,6,null,null,null,null,null,null,null,null,null,null,null,null,null,null,null,null,null,null,null,null,null,null,null,null,null,null,null,null,null,null,null,null,null,null,null,null,7,"The Whole-Time Equivalent salary for 01/04/2018 - 31/03/2019 (if the member is full-time, this should match cell 6)"]
[null,null," 18/19 WTE Final Salary Link Pay",null,0,null,7]
[null,null,null,null,null,null,null,null,null,null,null,null,null,null,null,null,null,null,null,null,null,null,null,null,null,null,null,null,null,null,null,null,null,null,null,null,null,null,null,null,null,null,null,8,"These cells will automatically be populated with the same service as cells 2. As members cannot accrue any further final salary service once they have transitioned in to the CARE Scheme, unless they have purchased an additional years contract. (If the member has an addtional years contract please conatct SPPA for service details)"]
[null,null,null,null,null,null,null,null,null,null,null,null,null,null,"Pension",null,null,null,null,null,{"$f":"'NHS FS Non Club Factors'!F113","v":17.829999999999998},{"$f":"'NHS CARE Non Club Factors'!I59","v":{"$error":"#NUM!"}},{"$f":"'NHS FS Non Club Factors'!F124","v":17.829999999999998},{"$f":"'NHS CARE Non Club Factors'!J59","v":{"$error":"#NUM!"}}]
[null,null,"Benefits (without inflation)",null,null,null,null,null,null,null,null,null,null,null,"Lump Sum",null,null,null,null,null,{"$f":"'NHS FS Non Club Factors'!F114","v":0.99},null,{"$f":"'NHS FS Non Club Factors'!F125","v":0.99},null,null,null,null,null,null,null,null,null,null,null,null,null,null,null,null,null,null,null,null,9,"The actual pensionable earnings for 01/04/2019 - 31/03/2020"]
[null,null," Final Salary Pension",null,{"$f":"U16","v":0},null,null," Final Salary Pension",null,null,{"$f":"W16","v":0},null,null,null,"Spouse",null,null,null,null,null,{"$f":"'NHS FS Non Club Factors'!F115","v":1.59},{"$f":"'NHS CARE Non Club Factors'!I60","v":{"$error":"#NUM!"}},{"$f":"'NHS FS Non Club Factors'!F126","v":1.59},{"$f":"'NHS CARE Non Club Factors'!J60","v":{"$error":"#NUM!"}}]
[null,null," Care Pension",null,{"$f":"V16","v":0},null,null," Care Pension",null,null,{"$f":"X16","v":0},null,null,null,"Care Adjust Factor",null,null,null,null,null,null,1,null,1,null,null,null,null,null,null,null,null,null,null,null,null,null,null,null,null,null,null,null,10,"The Whole-Time Equivalent salary for 01/04/2019 - 31/03/2020 (if the member is full-time, this should match cell 9)"]
[null,null," Total Pension",null,{"$f":"SUM(E26:F27)","v":0},null,null," Total Pension",null,null,{"$f":"SUM(K26:L27)","v":0}]
[null,null," Lump Sum",null,{"$f":"U42","v":0},null,null," Lump Sum",null,null,{"$f":"W42","v":0}]
[null,null,null,null,null,null,null,null,null,null,null,null,null,null,null,null,null,null,null,null,{"$f":"(U16)*U24","v":0},{"$f":"V16*V24","v":{"$error":"#NUM!"}},0,{"$error":"#NUM!"}]
[null,null," Final Salary CETV",null,{"$f":"U34","v":0},null,null," Final Salary CETV",null,null,{"$f":"W34","v":0},null,null,null,null,null,null,null,null,null,{"$f":"(U17)*U25","v":0},0,0,0]
[null,null," Care CETV",null,{"$f":"V34","v":{"$error":"#NUM!"}},null,null," Care CETV",null,null,{"$f":"X34","v":{"$error":"#NUM!"}},null,null,null,null,null,null,null,null,null,{"$f":"U18*U26","v":0},{"$error":"#NUM!"},0,{"$error":"#NUM!"}]
[null,null," Total CETV",null,{"$f":"SUM(E31:F32)","v":{"$error":"#NUM!"}},null,null," Total CETV",null,null,{"$f":"SUM(K31:L32)","v":{"$error":"#NUM!"}},null,null,null,null,null,null,null,null,null,null,{"$f":"SUM(V30:V32)","v":{"$error":"#NUM!"}},null,{"$f":"SUM(X30:X32)","v":{"$error":"#NUM!"}}]
[null,null,null,null,null,null,null,null,null,null,null,null,null,null,null,null,null,null,null,null,{"$f":"SUM(U30:U32)","v":0},{"$f":"V33*V27","v":{"$error":"#NUM!"}},{"$f":"SUM(W30:W32)","v":0},{"$f":"X33*X27","v":{"$error":"#NUM!"}},null,"Scheme Year","CARE Pension"]
[null,null,null,"Results (including inflation)",null,null,null,null,null,null,null,null,null,null,null,null,null,null,null,null,null,null,null,null,null,"15/16",{"$f":"(E18/54)*1.014","v":0}]
[null,null,null,null,null,null,null,null,null,null,null,null,null,null,null,null,null,null,null,null,{"$f":"U34+V34","v":{"$error":"#NUM!"}},null,{"$f":"W34+X34","v":{"$error":"#NUM!"}},null,null,"16/17",{"$f":"((E19/54)+AA35)*1.025","v":0}]
[null,null,null," Real Increase in Pension",null,null,null,{"$f":"(W16+X16)-AA16","v":0},null,null,null,null,null,null,null,null,null,null,null,null,{"$f":"U36*K6","v":{"$error":"#NUM!"}},null,null,null,null,"17/18",{"$f":"((E20/54)+AA36)*1.045","v":0}]
[null,null,null," Real Increase in Lump Sum",null,null,null,{"$f":"W17-AA17","v":0},null,null,null,null,null,null,"With Inflation",null,null,null,null,null,{"$f":"U36+U37","v":{"$error":"#NUM!"}},null,null,null,null,"18/19",{"$f":"((E21/54)+AA37)*1.039","v":0}]
[null,null,null," Accrued Pension",null,null,null,{"$f":"K28","v":0},null,null,null,null,null,null,null,null,null,null,null,null,null,null,null,null,null,"19/20",{"$f":"((K18/54)+AA38)*1.032","v":0}]
[null,null,null," Accrued Lump Sum",null,null,null,{"$f":"W42","v":0},null,null,null,null,null,null,"CETV",null,null,null,null,null,{"$f":"U38","v":{"$error":"#NUM!"}},null,{"$f":"W36","v":{"$error":"#NUM!"}}]
{"$rows_left_out":10}
{"sheet":"NHS FS Non Club Factors","index":1,"n_rows":130,"n_cols":32,"rows_kept":130,"cut":false,"hidden":true,"merged":[[128,0,128,1],[115,0,115,1],[116,0,116,1],[117,0,117,1],[121,12,121,15],[123,0,123,1],[124,0,124,1],[125,0,125,1],[126,0,126,1],[127,0,127,1],[121,16,121,19],[122,0,122,1],[121,0,121,11],[110,12,110,15],[110,16,110,19],[111,0,111,1],[112,0,112,1],[113,0,113,1],[114,0,114,1],[110,0,110,11],[1,0,2,0],[1,8,2,8],[1,16,2,16],[1,24,2,24],[54,0,54,7],[54,8,54,15],[54,16,54,23],[54,24,54,30]]}
["Table TV2 – 1995 section: Males Normal Pension Age 60",null,null,null,null,null,null,null,"Table TV2 – 1995 section: Females Normal Pension Age 60",null,null,null,null,null,null,null,"Table TV3 – 2008 Section: Males Normal Pension Age 65",null,null,null,null,null,null,null,"Table TV4 – 2008 Section: Females Normal Pension Age 65 (up to age 59)"]
["Age last birthday at guarantee date","Pension Factor","Lump Sum Factor ","Surviving Partner's Pension Factor ","Male Deduction for GMP ","Deduction for NI Modification ","GMP Adj ",null,"Age last birthday at guarantee date","Pension Factor","Lump Sum Factor ","Surviving Partner's Pension Factor ","Female Deduction for GMP ","Deduction for NI Modification ","GMP Adj ",null,"Age last birthday at guarantee date","Pension Factor ","Lump Sum Factor (Choice Optants only)","Surviving Partner's Pension Factor ","Male Deduction for GMP ","Deduction for NI Modification  ","GMP Adj ",null,"Age last birthday at guarantee date","Pension Factor ","Lump Sum Factor \n(Choice Optants only) ","Surviving Partner's Pension Factor ","Female Deduction for Pre88 GMP","Female Deduction for Post88 GMP  ","Deduction for NI Modification  ","GMP Adj "]
[null,"(Factor A)","(Factor B)","(Factor C)","(Factor D)","(Factor F)","Factor",null,null,"(Factor A)","(Factor B)","(Factor C)","(Factor D)","(Factor F)",null,null,null,"(Factor A)","(Factor B)","(Factor C)","(Factor D)","(Factor E)","Factor",null,null,"(Factor A)","(Factor B)","(Factor C)","(Factor D)","(Factor †E)","(Factor E)","Factor"]
[18,7.26,0.35,0.66,3.63,5.18,0.15,null,18,7.26,0.35,0.66,3.1,5.18,0.15,null,18,6.5,0.33,0.76,3.66,4.6500000000000004,0.15,null,18,6.5,0.33,0.76,-0.67,-0.67,4.6500000000000004,3.5]
[19,7.26,0.35,0.66,3.63,5.18,0.15,null,19,7.26,0.35,0.66,3.1,5.18,0.15,null,19,6.64,0.34,0.8,3.65,4.78,0.15,null,19,6.64,0.34,0.8,-0.68,-0.68,4.78,3.5]
[20,7.26,0.35,0.66,3.63,5.18,0.15,null,20,7.26,0.35,0.66,3.1,5.18,0.15,null,20,6.78,0.35,0.82,3.64,4.91,0.15,null,20,6.78,0.35,0.82,-0.7,-0.7,4.91,3.5]
[21,7.26,0.35,0.66,3.63,5.18,0.15,null,21,7.26,0.35,0.66,3.1,5.18,0.15,null,21,6.93,0.36,0.84,3.64,5.04,0.15,null,21,6.93,0.36,0.84,-0.71,-0.71,5.04,3.5]
[22,8.93,0.41,0.84,3.63,5.18,0.15,null,22,8.93,0.41,0.84,3.1,5.18,0.15,null,22,7.07,0.36,0.86,3.63,5.18,0.15,null,22,7.07,0.36,0.86,-0.73,-0.73,5.18,3.5]
[23,9.1300000000000008,0.42,0.86,3.63,5.32,0.15,null,23,9.1300000000000008,0.42,0.86,3.09,5.32,0.15,null,23,7.22,0.37,0.88,3.63,5.32,0.15,null,23,7.22,0.37,0.88,-0.74,-0.74,5.32,3.5]
[24,9.33,0.43,0.88,3.62,5.46,0.15,null,24,9.33,0.43,0.88,3.09,5.46,0.15,null,24,7.38,0.38,0.9,3.62,5.46,0.15,null,24,7.38,0.38,0.9,-0.76,-0.76,5.46,3.5]
[25,9.5299999999999994,0.44,0.91,3.61,5.61,0.15,null,25,9.5299999999999994,0.44,0.91,3.08,5.61,0.15,null,25,7.53,0.39,0.92,3.61,5.61,0.15,null,25,7.53,0.39,0.92,-0.78,-0.78,5.61,3.5]
[26,9.74,0.45,0.93,3.61,5.77,0.15,null,26,9.74,0.45,0.93,3.08,5.77,0.15,null,26,7.69,0.4,0.94,3.61,5.77,0.15,null,26,7.69,0.4,0.94,-0.79,-0.79,5.77,3.5]
[27,9.9499999999999993,0.46,0.95,3.6,5.92,0.15,null,27,9.9499999999999993,0.46,0.95,3.07,5.92,0.15,null,27,7.85,0.41,0.96,3.6,5.92,0.15,null,27,7.85,0.41,0.96,-0.81,-0.81,5.92,3.5]
[28,10.16,0.47,0.97,3.59,6.08,0.15,null,28,10.16,0.47,0.97,3.07,6.08,0.15,null,28,8.02,0.42,0.99,3.59,6.08,0.15,null,28,8.02,0.42,0.99,-0.82,-0.82,6.08,3.5]
[29,10.38,0.49,0.99,3.59,6.25,0.15,null,29,10.38,0.49,0.99,3.06,6.25,0.15,null,29,8.19,0.43,1.01,3.59,6.25,0.15,null,29,8.19,0.43,1.01,-0.84,-0.84,6.25,3.5]
[30,10.61,0.5,1.01,3.58,6.42,0.15,null,30,10.61,0.5,1.01,3.06,6.42,0.15,null,30,8.36,0.44,1.03,3.58,6.42,0.15,null,30,8.36,0.44,1.03,-0.86,-0.86,6.42,3.5]
[31,10.84,0.51,1.04,3.58,6.6,0.15,null,31,10.84,0.51,1.04,3.05,6.6,0.15,null,31,8.5399999999999991,0.45,1.05,3.58,6.6,0.15,null,31,8.5399999999999991,0.45,1.05,-0.87,-0.87,6.6,3.5]
[32,11.08,0.52,1.06,3.57,6.78,0.15,null,32,11.08,0.52,1.06,3.04,6.78,0.15,null,32,8.7200000000000006,0.46,1.08,3.57,6.78,0.15,null,32,8.7200000000000006,0.46,1.08,-0.89,-0.89,6.78,3.5]
[33,11.32,0.53,1.08,3.56,6.96,0.15,null,33,11.32,0.53,1.08,3.04,6.96,0.15,null,33,8.91,0.47,1.1000000000000001,3.56,6.96,0.15,null,33,8.91,0.47,1.1000000000000001,-0.9,-0.9,6.96,3.5]
[34,11.57,0.55000000000000004,1.1000000000000001,3.56,7.15,0.15,null,34,11.57,0.55000000000000004,1.1000000000000001,3.03,7.15,0.15,null,34,9.1,0.49,1.1200000000000001,3.56,7.15,0.15,null,34,9.1,0.49,1.1200000000000001,-0.92,-0.92,7.15,3.5]
[35,11.82,0.56000000000000005,1.1299999999999999,3.55,7.35,0.15,null,35,11.82,0.56000000000000005,1.1299999999999999,3.03,7.35,0.15,null,35,9.2899999999999991,0.5,1.1499999999999999,3.55,7.35,0.15,null,35,9.2899999999999991,0.5,1.1499999999999999,-0.94,-0.94,7.35,3.5]
[36,12.08,0.56999999999999995,1.1499999999999999,3.55,7.55,0.15,null,36,12.08,0.56999999999999995,1.1499999999999999,3.03,7.55,0.15,null,36,9.49,0.51,1.17,3.55,7.55,0.15,null,36,9.49,0.51,1.17,-0.96,-0.96,7.55,3.5]
[37,12.34,0.59,1.17,3.54,7.76,0.15,null,37,12.34,0.59,1.17,3.02,7.76,0.15,null,37,9.6999999999999993,0.52,1.19,3.54,7.76,0.15,null,37,9.6999999999999993,0.52,1.19,-0.97,-0.97,7.76,3.5]
[38,12.62,0.6,1.19,3.54,7.97,0.15,null,38,12.62,0.6,1.19,3.02,7.97,0.15,null,38,9.9,0.53,1.21,3.54,7.97,0.15,null,38,9.9,0.53,1.21,-0.99,-0.99,7.97,3.5]
[39,12.9,0.62,1.21,3.53,8.19,0.15,null,39,12.9,0.62,1.21,3.01,8.19,0.15,null,39,10.119999999999999,0.55000000000000004,1.24,3.53,8.19,0.15,null,39,10.119999999999999,0.55000000000000004,1.24,-1.01,-1.01,8.19,3.5]
[40,13.18,0.63,1.24,3.53,8.42,0.15,null,40,13.18,0.63,1.24,3.01,8.42,0.15,null,40,10.34,0.56000000000000005,1.26,3.53,8.42,0.15,null,40,10.34,0.56000000000000005,1.26,-1.02,-1.02,8.42,3.5]
[41,13.47,0.64,1.26,3.52,8.65,0.15,null,41,13.47,0.64,1.26,3,8.65,0.15,null,41,10.56,0.56999999999999995,1.28,3.52,8.65,0.15,null,41,10.56,0.56999999999999995,1.28,-1.04,-1.04,8.65,3.5]
[42,13.77,0.66,1.28,3.52,8.9,0.15,null,42,13.77,0.66,1.28,3,8.9,0.15,null,42,10.79,0.59,1.3,3.52,8.9,0.15,null,42,10.79,0.59,1.3,-1.06,-1.06,8.9,3.5]
[43,14.08,0.68,1.3,3.52,9.14,0.15,null,43,14.08,0.68,1.3,3,9.14,0.15,null,43,11.02,0.6,1.32,3.52,9.14,0.15,null,43,11.02,0.6,1.32,-1.08,-1.08,9.14,3.5]
[44,14.4,0.69,1.32,3.51,9.4,0.15,null,44,14.4,0.69,1.32,2.99,9.4,0.15,null,44,11.26,0.62,1.34,3.51,9.4,0.15,null,44,11.26,0.62,1.34,-1.1000000000000001,-1.1000000000000001,9.4,3.5]
[45,14.72,0.71,1.34,3.51,9.66,0.15,null,45,14.72,0.71,1.34,2.99,9.66,0.15,null,45,11.51,0.63,1.37,3.51,9.66,0.15,null,45,11.51,0.63,1.37,-1.1100000000000001,-1.1100000000000001,9.66,3.5]
[46,15.05,0.73,1.36,3.5,9.93,0.15,null,46,15.05,0.73,1.36,2.98,9.93,0.15,null,46,11.76,0.64,1.39,3.5,9.93,0.15,null,46,11.76,0.64,1.39,-1.1299999999999999,-1.1299999999999999,9.93,3.5]
[47,15.39,0.74,1.38,3.5,10.210000000000001,0.15,null,47,15.39,0.74,1.38,2.98,10.210000000000001,0.15,null,47,12.02,0.66,1.41,3.5,10.210000000000001,0.15,null,47,12.02,0.66,1.41,-1.1499999999999999,-1.1499999999999999,10.210000000000001,3.5]
[48,15.74,0.76,1.4,3.5,10.49,0.15,null,48,15.74,0.76,1.4,2.98,10.49,0.15,null,48,12.29,0.68,1.43,3.5,10.49,0.15,null,48,12.29,0.68,1.43,-1.17,-1.17,10.49,3.5]
[49,16.100000000000001,0.78,1.41,3.49,10.79,0.15,null,49,16.100000000000001,0.78,1.41,2.98,10.79,0.15,null,49,12.56,0.69,1.45,3.49,10.79,0.15,null,49,12.56,0.69,1.45,-1.19,-1.19,10.79,3.5]
[50,16.47,0.8,1.43,3.49,11.09,0.15,null,50,16.47,0.8,1.43,2.97,11.09,0.15,null,50,12.84,0.71,1.46,3.49,11.09,0.15,null,50,12.84,0.71,1.46,-1.21,-1.21,11.09,3.5]
[51,16.850000000000001,0.82,1.45,3.49,11.41,0.15,null,51,16.850000000000001,0.82,1.45,2.97,11.41,0.15,null,51,13.13,0.73,1.48,3.49,11.41,0.15,null,51,13.13,0.73,1.48,-1.23,-1.23,11.41,3.5]
[52,17.239999999999998,0.84,1.47,3.48,11.73,0.15,null,52,17.239999999999998,0.84,1.47,2.97,11.73,0.15,null,52,13.42,0.74,1.5,3.48,11.73,0.15,null,52,13.42,0.74,1.5,-1.25,-1.25,11.73,3.5]
[53,17.64,0.86,1.48,3.48,12.07,0.15,null,53,17.64,0.86,1.48,2.97,12.07,0.15,null,53,13.73,0.76,1.52,3.48,12.07,0.15,null,53,13.73,0.76,1.52,-1.27,-1.27,12.07,3.5]
[54,18.05,0.88,1.5,3.48,12.42,0.15,null,54,18.05,0.88,1.5,2.97,12.42,0.15,null,54,14.04,0.78,1.53,3.48,12.42,0.15,null,54,14.04,0.78,1.53,-1.29,-1.29,12.42,3.5]
{"$rows_left_out":91}
{"sheet":"NHS CARE Non Club Factors","index":2,"n_rows":62,"n_cols":10,"rows_kept":62,"cut":false,"hidden":true,"merged":[[2,1,3,1],[58,5,58,7],[59,5,59,7],[60,5,60,7],[61,5,61,7],[55,5,55,7],[55,8,55,9],[57,5,57,7]]}
[]
[null,"Table TV1 Member and Dependant CETV factors"]
[null,"Years to PNPA (rounded up)","Pension factor","Surviving Partner's Pension factor"]
[null,null,"(Factor A)","(Factor B)"]
[null,1,17.079999999999998,1.6]
[null,2,16.649999999999999,1.6]
[null,3,16.239999999999998,1.6]
[null,4,15.72,1.61]
[null,5,15.22,1.61]
[null,6,14.74,1.61]
[null,7,14.27,1.61]
[null,8,13.94,1.6]
[null,9,13.62,1.59]
[null,10,13.31,1.58]
[null,11,13.01,1.57]
[null,12,12.72,1.56]
[null,13,12.44,1.54]
[null,14,12.17,1.52]
[null,15,11.9,1.51]
[null,16,11.64,1.49]
[null,17,11.39,1.47]
[null,18,11.15,1.45]
[null,19,10.91,1.43]
[null,20,10.68,1.41]
[null,21,10.45,1.39]
[null,22,10.14,1.38]
[null,23,9.84,1.36]
[null,24,9.5500000000000007,1.35]
[null,25,9.27,1.33]
[null,26,9.08,1.31]
[null,27,8.89,1.29]
[null,28,8.7100000000000009,1.27]
[null,29,8.5299999999999994,1.25]
[null,30,8.35,1.22]
[null,31,8.18,1.2]
[null,32,8.01,1.18]
[null,33,7.85,1.1499999999999999]
[null,34,7.69,1.1299999999999999]
[null,35,7.53,1.1000000000000001]
[null,36,7.37,1.08]
{"$rows_left_out":22}