{"text_format":"1","workbook":"xlsx","n_sheets":14,"sheets":["VERA Pension Factors","VERA LS Factors","PI Data","Contents","Guidance Notes","Member Details","Age","PI Finder","Benefit Certificate","Letter","Practitioners Member Details","Practitioners Letter","Practitioners PI Finder","Practitioners Ben Certificate"],"not_rendered":{"charts":0,"images":5,"macros":1,"external_links":1,"defined_names":14,"comments":0,"pivot_tables":0},"unopened":[],"bounds":{"document_bytes":16777216,"sheet_cells":100000,"rows_first":2000,"rows_last":500,"rows_between":2000,"halvings":0,"cell_chars":16384,"cell_head_chars":4096},"cells_cut":0,"cells_raw":0,"read":"whole","date_system":"1900"}

{"sheet":"VERA Pension Factors","index":0,"n_rows":59,"n_cols":28,"rows_kept":59,"cut":false,"hidden":true,"merged":[[7,0,7,12],[36,0,36,12],[7,15,7,27],[36,15,36,27]]}
[1995]
["TABLE ERF1","Updated 29/01/2019",null,null,null,null,null,null,null,null,null,null,null,null,null,"TABLE ERF1",null,"Prior to factor change"]
["NHS SUPERANNUATION SCHEME SCOTLAND: ACTUARIAL FACTORS",null,null,null,null,null,null,null,null,null,null,null,null,null,null,"NHS SUPERANNUATION SCHEME SCOTLAND: ACTUARIAL FACTORS"]
["BENEFITS PAYABLE TO THE MEMBER ON VOLUNTARY EARLY RETIREMENT (WITH ACTUARIAL REDUCTION)",null,null,null,null,null,null,null,null,null,null,null,null,null,null,"BENEFITS PAYABLE TO THE MEMBER ON VOLUNTARY EARLY RETIREMENT (WITH ACTUARIAL REDUCTION)"]
["MEMBERS OF 1995 SECTION (RELATIVE TO PENSION AGE OF 60)",null,null,null,null,null,null,null,null,null,null,null,null,null,null,"MEMBERS OF 1995 SECTION (RELATIVE TO PENSION AGE OF 60)"]
[]
["Age: complete months",0,1,2,3,4,5,6,7,8,9,10,11,null,null,"Age: complete months",0,1,2,3,4,5,6,7,8,9,10,11]
["PENSION FACTORS",null,null,null,null,null,null,null,null,null,null,null,null,null,null,"PENSION FACTORS"]
[50,0.65400000000000003,0.65600000000000003,0.65800000000000003,0.66,0.66200000000000003,0.66400000000000003,0.66600000000000004,0.66800000000000004,0.67,0.67200000000000004,0.67400000000000004,0.67700000000000005,null,null,50,0.63300000000000001,0.63500000000000001,0.63700000000000001,0.64,0.64200000000000002,0.64400000000000002,0.64600000000000002,0.64800000000000002,0.65,0.65300000000000002,0.65500000000000003,0.65700000000000003]
[51,0.67900000000000005,0.68100000000000005,0.68300000000000005,0.68500000000000005,0.68700000000000006,0.68899999999999995,0.69199999999999995,0.69399999999999995,0.69599999999999995,0.69799999999999995,0.7,0.70199999999999996,null,null,51,0.65900000000000003,0.66100000000000003,0.66400000000000003,0.66600000000000004,0.66800000000000004,0.67100000000000004,0.67300000000000004,0.67500000000000004,0.67800000000000005,0.68,0.68200000000000005,0.68500000000000005]
{"$rows_left_out":50}
{"sheet":"VERA LS Factors","index":1,"n_rows":24,"n_cols":28,"rows_kept":24,"cut":false,"hidden":true,"merged":[[7,0,7,12],[7,15,7,27]]}
[]
["TABLE ERF7","Updated 29/01/2019",null,null,null,null,null,null,null,null,null,null,null,null,null,"TABLE ERF7",null,"Prior to factor change"]
["NHS SUPERANNUATION SCHEME SCOTLAND: ACTUARIAL FACTORS",null,null,null,null,null,null,null,null,null,null,null,null,null,null,"NHS SUPERANNUATION SCHEME SCOTLAND: ACTUARIAL FACTORS"]
["BENEFITS PAYABLE TO THE MEMBER ON VOLUNTARY EARLY RETIREMENT (WITH ACTUARIAL REDUCTION)",null,null,null,null,null,null,null,null,null,null,null,null,null,null,"BENEFITS PAYABLE TO THE MEMBER ON VOLUNTARY EARLY RETIREMENT (WITH ACTUARIAL REDUCTION)"]
["MEMBERS OF 1995 SECTION (RELATIVE TO PENSION AGE OF 60)",null,null,null,null,null,null,null,null,null,null,null,null,null,null,"MEMBERS OF 1995 SECTION (RELATIVE TO PENSION AGE OF 60)"]
[]
["AGE: complete months",0,1,2,3,4,5,6,7,8,9,10,11,null,null,"AGE: complete months",0,1,2,3,4,5,6,7,8,9,10,11]
["LUMP SUM FACTORS",null,null,null,null,null,null,null,null,null,null,null,null,null,null,"LUMP SUM FACTORS"]
["Complete Years:",null,null,null,null,null,null,null,null,null,null,null,null,null,null,"Complete Years:"]
[50,0.78900000000000003,0.79,0.79200000000000004,0.79400000000000004,0.79500000000000004,0.79700000000000004,0.79800000000000004,0.8,0.80100000000000005,0.80300000000000005,0.80500000000000005,0.80600000000000005,null,null,50,0.73199999999999998,0.73399999999999999,0.73599999999999999,0.73799999999999999,0.74,0.74199999999999999,0.74399999999999999,0.746,0.748,0.75,0.751,0.753]
{"$rows_left_out":15}
{"sheet":"PI Data","index":2,"n_rows":547,"n_cols":3,"rows_kept":547,"cut":false,"hidden":true,"merged":[]}
[{"$f":"MIN($B$2:$Z$2)","v":2019}]
[{"$f":"MAX($B$2:$Z$2)","v":2020},2019,2020]
["1945-01-01",41.6404,42.348300000000002]
["1946-01-01",37.851999999999997,38.4955]
["1947-01-01",37.513500000000001,38.151200000000003]
["1948-01-01",35.127600000000001,35.724699999999999]
["1949-01-01",34.160299999999999,34.741]
["1950-01-01",33.193100000000001,33.757300000000001]
["1951-01-01",30.4041,30.920999999999999]
["1952-01-01",27.856999999999999,28.3306]
{"$rows_left_out":538}
{"sheet":"Contents","index":3,"n_rows":35,"n_cols":5,"rows_kept":35,"cut":false,"hidden":false,"merged":[[34,1,35,17],[3,1,5,3],[3,4,5,17],[6,1,25,17],[28,1,29,17],[30,1,33,17]]}
[]
[]
[]
[null,null,null,null,"NHS Superannuation Scheme (Scotland) Preserved Benefits Estimate Calculator"]
[]
[]
[]
[]
[]
[]
{"$rows_left_out":26}
{"sheet":"Guidance Notes","index":4,"n_rows":48,"n_cols":2,"rows_kept":48,"cut":false,"hidden":true,"merged":[[0,1,2,14],[42,1,45,14],[46,1,46,14],[47,1,49,14],[40,1,41,14],[4,1,37,14]]}
[null,"Guidance Notes"]
[]
[]
[]
[null,"Understanding your results\n\nThis calculator is solely for guidance purposes and is an estimate only.  It is not a statement of your legal entitlement and is not intended to provide you with financial advice.  While every care has been taken in the preparation of this calculator the Scottish Public Pensions Agency will accept no responsibility for the accuracy of the information it provides.  If you require financial advice, you should contact an authorised independent financial adviser.  \n\nAs you are no longer in pensionable employment, your basic retirement benefits should remain unchanged.  These will be index linked in line with inflation.  Please note, this calculator is only for 1995 or 2008 members.  \n\nYou should have received a preserved letter detailing the breakdown of your deferred retirement benefits.  You will need this information to allow you to project a current estimate of your benefits.  Please note that if your pension breakdown may not provide you with your deemed date which is used to calculate how much pension increase you may be entitled to.  If this is the case the calculator will assume this date is the day after your last day worked (final year).  If your pensionable salary used is your second or third last year this may underinflate the pension increase you are entitled to.  Alternatively you can contact the Agency and request your deemed date.\n\nIf your date of leaving is after 30 March 2000, you may claim your benefits prior to your Normal Pension Age (NPA) if you wish but this will be subject to a reduction as it will be paid early.  If you are aged 55 or over the calculator will allow you to estimate your retirement benefits to include the VERA reduction.  If you simply wish to have a current estimate of your deferred benefits please state \"No\" when prompted.\n\nTo calculate your estimated benefits, you need to complete the necessary information under \"Member Details\".  Once  you have completed all the relevant information your estimated benefits will be shown on the \"Benefit Certificate\" and \"Letter\".  If you do not complete all of the necessary information your estimate will not work.  \n\nEach page allows you to go back to previous stages if you wish by simply clicking on the relevant box to where you wish to go.\n\nPractitioners\n\nIf you are a Practitioner, please use the \"Practitioners Member Details\" as your preserved benefits are calculated differently.    Once  you have completed all the relevant information your estimated benefits will be shown on the \"Practitioners Benefit Certificate\" and \"Practitioners Letter\".  If you do not complete all of the necessary information your estimate will not work.  "]
[]
[]
[]
[]
[]
{"$rows_left_out":39}
{"sheet":"Member Details","index":5,"n_rows":38,"n_cols":21,"rows_kept":38,"cut":false,"hidden":true,"merged":[[1,5,3,18],[11,8,11,9],[11,10,11,13],[19,10,19,11],[19,12,19,13],[5,9,5,14],[13,8,13,9],[13,10,13,13],[7,12,7,13],[9,10,9,13],[15,10,15,13],[7,8,7,9],[9,7,9,9],[15,7,15,9],[37,8,37,9],[37,10,37,13],[17,8,17,9],[17,10,17,13],[20,7,20,9],[34,8,34,9],[35,8,35,9],[31,10,31,13],[32,10,32,13],[33,10,33,13],[34,10,34,13],[35,10,35,13],[31,8,31,9],[32,8,32,9],[33,8,33,9],[29,8,29,15],[1,2,3,4],[8,2,8,4],[9,2,9,4],[14,2,14,4],[15,2,15,4],[24,16,24,17],[24,14,24,15],[17,2,17,4],[22,10,22,13],[20,10,20,11],[24,10,24,13],[20,12,20,13],[22,6,22,9]]}
[]
[null,null,null,null,null,"NHS Superannuation Scheme (Scotland) Preserved Benefits Estimate Calculator"]
[]
[]
[]
[null,null,null,null,"Member Details",null,null,null,null,"PLEASE COMPLETE ALL NECESSARY DATA"]
[]
[null,null,null,null,null,null,null,null,"Members Name  ",null,null,null,null,null,null,"Eg: Mr | J | Smith"]
[]
[null,null,null,null,null,null,null,"Superannuation Number  "]
{"$rows_left_out":29}
{"sheet":"Age","index":6,"n_rows":20,"n_cols":27,"rows_kept":20,"cut":false,"hidden":true,"merged":[]}
[]
[]
[null,null,"Period Calculator V 1.3"]
[null,null,null,null,null,null,null,null,null,null,null,null,null,null,null,null,1,365,31,31]
[null,null,null,null,null,null,null,null,null,null,null,null,null,null,null,null,2,334,59,28]
[null,null,null,"dd","mm","yyyy",null,null,null,null,null,null,null,null,null,null,3,306,90,31]
[null,null,"Date From :",{"$f":"DAY(M15)","v":0},{"$f":"MONTH(M15)","v":1},{"$f":"YEAR(M15)","v":1900},{"$f":"IF(AA9>0,AA9,0)","v":43967},"Days",null,null,null,null,null,null,null,null,4,275,120,30,{"$f":"D7","v":0},{"$f":"IF(E7>0,VLOOKUP($E$7,Table50,2),0)","v":365},{"$f":"F7","v":1900},{"$f":"IF(E7>0,VLOOKUP($E$7,Table50,4),0)","v":31},{"$f":"(V7+1)-U7","v":366},{"$f":"(W7*365)-Y7","v":693134},{"$f":"Y7+Z7","v":693500}]
[null,null,"Date To :",{"$f":"DAY(M16)","v":15},{"$f":"MONTH(M16)","v":6},{"$f":"YEAR(M16)","v":2020},{"$f":"IF(G7>0,G7/365,0)","v":120.45753424657535},"Years",{"$f":"((F8-F7)*12)+(E8-E7)","v":1445},"Months",null,null,null,null,null,null,5,245,151,31,{"$f":"D8","v":15},{"$f":"IF(E8>0,VLOOKUP($E$8,Table50,3),0)","v":181},{"$f":"F8","v":2020},{"$f":"IF(E8>0,VLOOKUP($E$8,Table50,4),0)","v":30},{"$f":"(V8-X8)+U8","v":166},{"$f":"((W8*365)-365)+Y8","v":737101},{"$f":"Z8+Y7","v":737467}]
[null,null,null,null,null,"                                                                                                                                                                                                                                                                                                                                                                                                                    ",null,null,null,null,null,null,null,null,null,null,6,214,181,30,null,null,null,null,null,null,{"$f":"AA8-AA7","v":43967}]
[null,null,"Duration :",{"$f":"TRUNC(G8)","v":120},"Years",{"$f":"(G8-D10)*365","v":167.0000000000025},"Days",null,null,null,null,null,null,null,null,null,7,184,212,31]
{"$rows_left_out":11}
{"sheet":"PI Finder","index":7,"n_rows":9,"n_cols":7,"rows_kept":9,"cut":false,"hidden":true,"merged":[]}
[]
[null,null,null,null,null,"yyyy","PI Date"]
[null,null,"Select PI table:",null,null,{"$f":"IF(AND('Member Details'!K25=\"Yes\",'Member Details'!Q25<G3),2019,2020)","v":2020},43927]
[]
[null,null,null,null,null,"dd/mm/yyyy"]
[null,null,"Enter date for PI:",null,null,{"$f":"IF('Member Details'!K23=\"\",'Member Details'!S23,'Member Details'!K23)","v":"1900-01-01"}]
[]
[]
[null,null,"PI for this date is:",null,null,{"$f":"IF(F6=0/1/1900,1,VLOOKUP(F6,'PI Data'!$A$3:$AZ$998,F3 - 'PI Data'!$A$1 + 2))","v":{"$error":"#N/A"}}]

{"sheet":"Benefit Certificate","index":8,"n_rows":35,"n_cols":11,"rows_kept":35,"cut":false,"hidden":true,"merged":[[10,0,10,1],[10,2,10,3],[0,0,0,4],[1,0,1,4],[2,0,2,4],[3,0,3,4],[4,2,4,3],[5,2,5,3],[6,0,6,4],[7,0,7,2],[7,3,7,4],[9,0,9,2],[9,3,9,4],[11,0,11,1],[11,2,11,3],[12,0,12,1],[13,0,13,1],[13,3,13,4],[15,0,15,1],[15,3,15,4],[26,0,26,1],[26,3,26,4],[17,0,17,4],[18,0,18,2],[18,3,18,4],[20,0,20,2],[20,3,20,4],[21,0,21,1],[22,0,22,1],[22,2,22,3],[24,0,24,2],[24,3,24,4],[23,0,23,4],[25,0,25,4],[28,0,28,4],[29,0,29,2],[29,3,29,4],[30,0,30,2],[30,3,30,4],[34,0,34,2],[34,3,34,4],[31,0,31,2],[31,3,31,4],[32,0,32,2],[32,3,32,4],[33,0,33,2],[33,3,33,4]]}
[{"$f":"IF('Member Details'!K14=1995,\"NHS 1995 Section\",\"NHS 2008 Section\")","v":"NHS 2008 Section"}]
["Estimated Retirement Benefits from Deferred Status"]
[{"$f":"IF(AND('Member Details'!Q16=\"VERA\",Age!M18<60,'Member Details'!K25=\"Yes\"),\"with Actuarial Reduced Pension\",\"\")","v":""}]
[{"$f":"IF('Member Details'!Q25<>\"\",'Member Details'!Q25,NOW())","v":"2020-06-15T11:11:08.860"}]
["Name:",{"$f":"'Member Details'!K8&\" \"&'Member Details'!L8&\" \"&'Member Details'!M8","v":"  "},"Last day of Service:",null,{"$f":"'Member Details'!K16","v":"00:00:00"}]
["NI Number:",{"$f":"'Member Details'!K38","v":0},"Reference:",null,{"$f":"'Member Details'!K10","v":0}]
["Annual Pension"]
["Pensionable Service"]
[]
[{"$f":"IF('Member Details'!K14=1995,'Member Details'!K21&\" Years \"& 'Member Details'!M21&\" Days x 1/80th of £\"&'Member Details'!K18,'Member Details'!K21&\" Years \"& 'Member Details'!M21&\" Days x 1/60th of £\"&'Member Details'!K18)","v":" Years  Days x 1/60th of £"},null,null,{"$f":"IF('Member Details'!K14=1995,(('Member Details'!M21/365)+'Member Details'!K21)*'Member Details'!K18/80,(('Member Details'!M21/365)+'Member Details'!K21)*'Member Details'!K18/60)","v":0}]
{"$rows_left_out":26}
{"sheet":"Letter","index":9,"n_rows":103,"n_cols":8,"rows_kept":103,"cut":false,"hidden":true,"merged":[[11,0,11,2],[30,2,30,3],[11,6,11,7],[30,6,30,7],[26,2,26,3],[27,2,27,3],[25,4,25,5],[26,4,26,5],[16,6,16,7],[22,0,23,7],[30,0,30,1],[12,0,12,2],[30,4,30,5],[18,0,18,3],[25,6,25,7],[26,6,26,7],[74,0,81,8],[102,0,109,8],[61,0,72,8],[82,0,101,8],[31,14,31,15],[32,0,32,7],[50,0,50,3],[33,0,33,1],[33,2,33,3],[33,4,33,5],[33,6,33,7],[38,0,42,7],[35,0,37,7],[43,0,44,7],[31,12,31,13],[27,6,27,7],[27,4,27,5],[12,6,12,7],[29,0,29,7],[20,0,20,7],[25,0,25,1],[26,0,26,1],[27,0,27,1],[25,2,25,3],[4,6,4,7],[5,6,5,7],[6,6,6,7],[10,0,10,2],[9,0,9,2],[8,0,8,2],[10,6,10,7]]}
[]
[]
[]
[]
[null,null,null,null,null,null,"7 Tweedside Park"]
[null,null,null,null,null,null,"Tweedbank"]
[null,null,null,null,null,null,"Galashiels"]
[null,null,null,null,null,null,null,"TD1 3TE"]
[{"$f":"'Member Details'!K8&\" \"&'Member Details'!L8&\" \"&'Member Details'!M8","v":"  "},null,null,null,null,null,null,"www.pensions.gov.scot"]
[{"$f":"'Member Details'!K32","v":0}]
{"$rows_left_out":94}
{"sheet":"Practitioners Member Details","index":10,"n_rows":35,"n_cols":21,"rows_kept":35,"cut":false,"hidden":true,"merged":[[32,8,32,9],[32,10,32,13],[34,8,34,9],[34,10,34,13],[19,10,19,13],[19,7,19,9],[29,8,29,9],[29,10,29,13],[30,8,30,9],[30,10,30,13],[31,8,31,9],[31,10,31,13],[21,10,21,13],[21,14,21,15],[21,16,21,17],[26,8,26,15],[28,8,28,9],[28,10,28,13],[14,2,14,4],[15,2,15,4],[15,10,15,13],[17,2,17,4],[17,10,17,13],[17,7,17,9],[15,7,15,9],[13,8,13,9],[13,10,13,13],[1,2,3,4],[1,5,3,18],[5,9,5,14],[7,8,7,9],[7,12,7,13],[8,2,8,4],[9,2,9,4],[9,10,9,13],[11,8,11,9],[11,10,11,13],[9,7,9,9]]}
[]
[null,null,null,null,null,"NHS Superannuation Scheme (Scotland) Preserved Benefits Estimate Calculator"]
[]
[]
[]
[null,null,null,null,"Practitioner Member Details",null,null,null,null,"PLEASE COMPLETE ALL NECESSARY DATA"]
[]
[null,null,null,null,null,null,null,null,"Members Name  ",null,null,null,null,null,null,"Eg: Mr | J | Smith"]
[]
[null,null,null,null,null,null,null,"Superannuation Number  "]
{"$rows_left_out":26}
{"sheet":"Practitioners Letter","index":11,"n_rows":87,"n_cols":8,"rows_kept":87,"cut":false,"hidden":true,"merged":[[9,0,9,2],[20,0,20,7],[4,6,4,7],[5,6,5,7],[6,6,6,7],[8,0,8,2],[10,0,10,2],[10,6,10,7],[11,0,11,2],[11,6,11,7],[12,0,12,2],[12,6,12,7],[16,6,16,7],[18,0,18,3],[13,0,13,2],[14,0,14,2],[22,0,23,7],[25,0,25,1],[25,2,25,3],[25,4,25,5],[25,6,25,7],[26,0,26,1],[26,2,26,3],[26,4,26,5],[26,6,26,7],[27,0,27,1],[27,2,27,3],[27,4,27,5],[27,6,27,7],[28,14,28,15],[29,0,29,7],[30,0,30,1],[30,2,30,3],[30,4,30,5],[30,6,30,7],[28,12,28,13],[86,0,108,8],[110,0,113,8],[65,0,85,8],[32,0,34,7],[35,0,39,7],[40,0,41,7],[49,0,49,3]]}
[]
[]
[]
[]
[null,null,null,null,null,null,"7 Tweedside Park"]
[null,null,null,null,null,null,"Tweedbank"]
[null,null,null,null,null,null,"Galashiels"]
[null,null,null,null,null,null,null,"TD1 3TE"]
[{"$f":"'Practitioners Member Details'!K8&\" \"&'Practitioners Member Details'!L8&\" \"&'Practitioners Member Details'!M8","v":"  "},null,null,null,null,null,null,"www.pensions.gov.scot"]
[{"$f":"'Practitioners Member Details'!K29","v":0}]
{"$rows_left_out":78}
{"sheet":"Practitioners PI Finder","index":12,"n_rows":9,"n_cols":7,"rows_kept":9,"cut":false,"hidden":true,"merged":[]}
[]
[null,null,null,null,null,"yyyy","PI Date"]
[null,null,"Select PI table:",null,null,{"$f":"IF(AND('Practitioners Member Details'!K25=\"Yes\",'Practitioners Member Details'!Q25<G3),2019,2020)","v":2020},43927]
[]
[null,null,null,null,null,"dd/mm/yyyy"]
[null,null,"Enter date for PI:",null,null,{"$f":"'Practitioners Member Details'!P16","v":"1900-01-01"}]
[]
[]
[null,null,"PI for this date is:",null,null,{"$f":"IF(F6=0/1/1900,1,VLOOKUP(F6,'PI Data'!$A$3:$AZ$998,F3 - 'PI Data'!$A$1 + 2))","v":{"$error":"#N/A"}}]

{"sheet":"Practitioners Ben Certificate","index":13,"n_rows":35,"n_cols":11,"rows_kept":35,"cut":false,"hidden":true,"merged":[[34,0,34,2],[34,3,34,4],[31,0,31,2],[31,3,31,4],[32,0,32,2],[32,3,32,4],[33,0,33,2],[33,3,33,4],[30,0,30,2],[30,3,30,4],[22,0,22,1],[22,2,22,3],[23,0,23,4],[24,0,24,2],[24,3,24,4],[25,0,25,4],[26,0,26,1],[26,3,26,4],[28,0,28,4],[29,0,29,2],[29,3,29,4],[21,0,21,1],[11,0,11,1],[11,2,11,3],[12,0,12,1],[13,0,13,1],[13,3,13,4],[15,0,15,1],[15,3,15,4],[17,0,17,4],[18,0,18,2],[18,3,18,4],[20,0,20,2],[20,3,20,4],[10,0,10,1],[10,2,10,3],[0,0,0,4],[1,0,1,4],[2,0,2,4],[3,0,3,4],[4,2,4,3],[5,2,5,3],[6,0,6,4],[7,0,7,2],[7,3,7,4],[9,0,9,2],[9,3,9,4]]}
[{"$f":"IF('Practitioners Member Details'!K14=1995,\"NHS 1995 Section\",\"NHS 2008 Section\")","v":"NHS 2008 Section"}]
["Estimated Retirement Benefits from Deferred Status"]
[{"$f":"IF(AND('Practitioners Member Details'!Q16=\"VERA\",Age!M18<60,'Practitioners Member Details'!K23=\"Yes\"),\"with Actuarial Reduced Pension\",\"\")","v":""}]
[{"$f":"IF('Practitioners Member Details'!Q23<>\"\",'Practitioners Member Details'!Q23,NOW())","v":"2020-06-15T11:11:08.860"}]
["Name:",{"$f":"'Practitioners Member Details'!K8&\" \"&'Practitioners Member Details'!L8&\" \"&'Practitioners Member Details'!M8","v":"  "},"Last day of Service:",null,{"$f":"'Practitioners Member Details'!K16","v":"00:00:00"}]
["NI Number:",{"$f":"'Practitioners Member Details'!K35","v":0},"Reference:",null,{"$f":"'Practitioners Member Details'!K10","v":0}]
["Annual Pension"]
[]
[]
["Deferred Basic Total Pension",null,null,{"$f":"'Practitioners Member Details'!K18","v":0}]
{"$rows_left_out":25}