{"text_format":"1","workbook":"xlsx","n_sheets":9,"sheets":["Calculator","Codes","Factors","LumpSumPrint1","LumpSumPrint2","RegularContsPrint1","RegularContsPrint2","Application","GuidanceNotes"],"not_rendered":{"charts":0,"images":5,"macros":1,"external_links":0,"defined_names":8,"comments":1,"pivot_tables":0},"unopened":[],"bounds":{"document_bytes":16777216,"sheet_cells":100000,"rows_first":2000,"rows_last":500,"rows_between":2000,"halvings":0,"cell_chars":16384,"cell_head_chars":4096},"cells_cut":0,"cells_raw":0,"read":"whole","date_system":"1900"}

{"sheet":"Calculator","index":0,"n_rows":45,"n_cols":14,"rows_kept":45,"cut":false,"hidden":false,"merged":[[45,3,45,7],[1,1,1,6],[14,6,17,7],[53,2,53,7],[3,3,3,4],[4,3,4,4],[5,3,5,4],[6,3,6,4],[7,3,7,4],[8,3,8,4],[16,3,16,4]]}
[]
[null,"Fire 2015 Added Pension Benefit Cost Calculator"]
[null,null,"Member Details"]
[null,null,"Surname",null,null,"Title",null,null,null,null,{"$f":"Codes!A23","v":"Mr"},{"$f":"Codes!A20","v":"Male"}]
[null,null,"Former Surname (if applicable)",null,null,null,null,null,null,null,{"$f":"Codes!A24","v":"Dr"},{"$f":"Codes!A21","v":"Female"}]
[null,null,"Forenames (in full)",null,null,null,"Please specify","Rev",null,null,{"$f":"Codes!A25","v":"Ms"}]
[null,null,"Contact Address",null,null,null,null,null,null,null,{"$f":"Codes!A26","v":"Mrs"}]
[null,null,null,null,null,null,null,null,null,null,{"$f":"Codes!A27","v":"Miss"}]
[null,null,null,null,null,null,null,null,null,null,{"$f":"Codes!A28","v":"Other"}]
[null,null,"Postcode"]
[null,null,"Home telephone number"]
[null,null,"Mobile telephone number"]
[null,null,"Email address"]
[null,null,"National insurance number"]
[null,null,"Date of Birth ",null,null,null,{"$f":"IF(Codes!K27=60, \"You may only pay by lump sum. You must be 2 years from NPA to pay by monthly contributions\",\"\")","v":""},null,null,null,"Earliest DOB",{"$f":"Codes!B15","v":"1959-12-12"},"Latest DOB",{"$f":"Codes!B16","v":"2001-12-11T12:00:00"}]
[null,null,"Gender"]
[null,null,"Current employer"]
[null,null,"How would you like to pay for your added pension? ",null,null,null,null,null,null,"Lump Sum"]
[null,null,"Lump Sum Payments"]
[]
{"$rows_left_out":26}
{"sheet":"Codes","index":1,"n_rows":55,"n_cols":29,"rows_kept":55,"cut":false,"hidden":true,"merged":[[10,3,15,3],[2,25,4,26],[2,27,4,28],[5,28,6,28],[5,27,6,27],[5,26,6,26],[5,25,6,25],[5,22,6,22],[5,21,6,21],[3,10,4,10],[11,5,11,6],[10,8,15,8],[7,6,9,6],[8,10,10,10],[5,13,6,13],[5,12,6,12],[1,25,1,26],[5,14,6,14],[5,16,6,16],[5,18,6,18],[5,17,6,17],[5,15,6,15],[5,23,6,23],[5,20,6,20],[5,19,6,19],[5,24,6,24]]}
["Member data",null,null,null,null,null,"Lump Sum",null,null,null,"Regular Contributions  "]
["DOB",{"$f":"Calculator!D15","v":"00:00:00"},null,null,null,null,"Definitions",null,null,null,"Definitions",null,null,null,null,null,null,null,null,null,null,null,null,null,null,"Level contributions",null,"Contributions required for this much AP "]
["Normal retirement date",{"$f":"DATE(YEAR(Calculator!D15)+60,MONTH(Calculator!D15),DAY(Calculator!D15))","v":"1959-12-31"},null,null,null,"P= ","amount of additional pension purchased",null,null,"C=","Total amount of periodic contributions over scheme year",null,null,null,null,null,null,null,null,null,null,null,null,null,null,". P=(1.025x xC)/(Fx x FyReval)",null,"MP=(P x Fx x FyReval)/(number of monthly conts x 1.025)"]
["31 March that yr",{"$f":"DATE(YEAR(B3),3,31)","v":"1959-03-31"},null,null,null,"LS=","Amount of lump sum payment",null,null,"Adj=","1.025 (equivilent to an addition of half a years interest on contributions payable throughout the scheme year"]
["31 March before NPA",{"$f":"IF(B4>B3,DATE(YEAR(B4)-1,3,31),DATE(YEAR(B4),3,31))","v":"1959-03-31"},null,null,null,"x=","Members age last birthday on calculation date"]
["1 April before NPA",{"$f":"IF(Calculator!D15=\"\",\"\",B5+1)","v":""},null,null,null,null,null,null,null,"x=","members age last birthday at end of scheme year",null,null,"Year","First payment month (April = 4)","First payment month (April = 1)","Last payment month (march = 3)","Last payment month (march = 12)","Start of scheme year","End of scheme year","No of monthly payments","x","Fx","y","FyReval","C = Payments over scheme year","Level contributions of X buy this much AP…","P=amount of AP purchased","Buying X AP will cost contribution of…"]
["18th birthday",{"$f":"DATE(YEAR(Calculator!D15)+18,MONTH(Calculator!D15),DAY(Calculator!D15))","v":"1917-12-31"},null,null,null,"Fx= ","lump sum factor at age x (table 1:lump sum factors)",null,null,"Y=","Number of subsequent scheme years up to NPA"]
["Current age",{"$f":"IF(Calculator!D15=\"\",0,ROUNDDOWN((TODAY()-Calculator!D15)/365.25,0))","v":0},null,null,null,"FyReval=","Relevant revaluation factor for a member with y complete scheme years between calc date and up to and including NPA (table 2:added pension reval factors)",null,null,"Fx= ","regular conts factor at age x (table 1:lump sum factors)",null,{"$f":"IF(Calculator!D15=\"\",\"\",YEAR(Codes!K17)-1&\" / \"&YEAR(Codes!K17))","v":""},1,{"$f":"MONTH(K15)","v":12},{"$f":"IF(OR(O8=1,O8=2,O8=3),O8+9,O8-3)","v":9},3,{"$f":"IF(M8=\"\",\"\",IF(M9=\"\",K$25,IF(OR(Q8=1,Q8=2,Q8=3),Q8+9,Q8-3)))","v":""},{"$f":"DATE(YEAR(T8)-1,4,1)","v":"2019-04-01"},{"$f":"K17","v":"2020-03-31"},{"$f":"IF(M8=\"\",\"\",R8-P8+1)","v":""},{"$f":"IF(Calculator!$D$15=\"\",0,K27)","v":0},{"$f":"IF(V8=\"\",\"\",VLOOKUP(V8,Factors!$A$10:$B$51,2,FALSE))","v":{"$error":"#N/A"}},{"$f":"DATEDIF(K17,B5,\"y\")","v":{"$error":"#NUM!"}},{"$f":"IF(X8=\"\",\"\",VLOOKUP(X8,Factors!$F$10:$G$50,2,FALSE))","v":{"$error":"#NUM!"}},{"$f":"IF(M8=\"\",\"\",Calculator!$D$37*U8)","v":""},{"$f":"IF(M8=\"\",\"\",(1.025*Z8)/(W8*Y8))","v":""},{"$f":"IF(M8=\"\",\"\",Calculator!$D$42)","v":""},{"$f":"IF(M8=\"\",\"\",(AB8*W8*Y8)/(U8*1.025))","v":""}]
[null,null,null,null,null,null,null,null,null,"FyReval=","Relevent revaluation factor for member with y complete scheme years between calc date and up to and including NPA (table 2:added pension reval factors)",null,{"$f":"IF(S9<>\"\",YEAR(Codes!$K$17)+(N9-2)&\" / \"&YEAR(Codes!$K$17)+(N9-1),\"\")","v":""},{"$f":"IF(S9=\"\",\"\",N8+1)","v":""},null,{"$f":"IF(M9=\"\",\"\",1)","v":""},{"$f":"IF(OR(M9=\"\",M10=\"\"),\"\",IF(T9<=K$19,3,MONTH(I$8)))","v":""},"",{"$f":"IF(S8=\"\",\"\",IF(DATE(YEAR(S8)+1,4,1)<K$19,DATE(YEAR(S8)+1,4,1),\"\"))","v":""},{"$f":"IF(M9=\"\",\"\",IF(DATE(YEAR(T8)+1,3,31)<=K$19,DATE(YEAR(T8)+1,3,31),\"\"))","v":""},{"$f":"IF(M9=\"\",\"\",R9-P9+1)","v":""},{"$f":"IF(M9=\"\",\"\",V8+1)","v":""},{"$f":"IF(V9=\"\",\"\",VLOOKUP(V9,Factors!$A$10:$B$51,2,FALSE))","v":""},{"$f":"IF(M9=\"\",\"\",X8-1)","v":""},{"$f":"IF(X9=\"\",\"\",VLOOKUP(X9,Factors!$F$10:$G$50,2,FALSE))","v":""},{"$f":"IF(M9=\"\",\"\",Calculator!$D$37*U9)","v":""},"",{"$f":"IF(M9=\"\",\"\",Calculator!$D$42)","v":""},{"$f":"IF(M9=\"\",\"\",(AB9*W9*Y9)/(U9*1.025))","v":""}]
["Today",{"$f":"TODAY()","v":"2019-12-11"},null,null,null,null,null,null,null,null,null,null,{"$f":"IF(S10<>\"\",YEAR(Codes!$K$17)+(N10-2)&\" / \"&YEAR(Codes!$K$17)+(N10-1),\"\")","v":""},"",null,"","","","","","","",{"$f":"IF(V10=\"\",\"\",VLOOKUP(V10,Factors!$A$10:$B$51,2,FALSE))","v":""},"",{"$f":"IF(X10=\"\",\"\",VLOOKUP(X10,Factors!$F$10:$G$50,2,FALSE))","v":""},{"$f":"IF(M10=\"\",\"\",Calculator!$D$37*U10)","v":""},"",{"$f":"IF(M10=\"\",\"\",Calculator!$D$42)","v":""},""]
["Scheme start date","2015-04-01",null,null,null,null,null,null,null,null,null,null,{"$f":"IF(S11<>\"\",YEAR(Codes!$K$17)+(N11-2)&\" / \"&YEAR(Codes!$K$17)+(N11-1),\"\")","v":""},"",null,"","","","","","","",{"$f":"IF(V11=\"\",\"\",VLOOKUP(V11,Factors!$A$10:$B$51,2,FALSE))","v":""},"",{"$f":"IF(X11=\"\",\"\",VLOOKUP(X11,Factors!$F$10:$G$50,2,FALSE))","v":""},{"$f":"IF(M11=\"\",\"\",Calculator!$D$37*U11)","v":""},"",{"$f":"IF(M11=\"\",\"\",Calculator!$D$42)","v":""},""]
[null,null,null,null,null,"Calculating complete scheme years between calc date and NPA",null,null,null,"P=","amount of AP purchased",null,{"$f":"IF(S12<>\"\",YEAR(Codes!$K$17)+(N12-2)&\" / \"&YEAR(Codes!$K$17)+(N12-1),\"\")","v":""},"",null,"","","","","","","",{"$f":"IF(V12=\"\",\"\",VLOOKUP(V12,Factors!$A$10:$B$51,2,FALSE))","v":""},"",{"$f":"IF(X12=\"\",\"\",VLOOKUP(X12,Factors!$F$10:$G$50,2,FALSE))","v":""},{"$f":"IF(M12=\"\",\"\",Calculator!$D$37*U12)","v":""},"",{"$f":"IF(M12=\"\",\"\",Calculator!$D$42)","v":""},""]
["Data limits",null,null,null,null,null,null,null,null,null,null,null,{"$f":"IF(S13<>\"\",YEAR(Codes!$K$17)+(N13-2)&\" / \"&YEAR(Codes!$K$17)+(N13-1),\"\")","v":""},"",null,"","","","","","","",{"$f":"IF(V13=\"\",\"\",VLOOKUP(V13,Factors!$A$10:$B$51,2,FALSE))","v":""},"",{"$f":"IF(X13=\"\",\"\",VLOOKUP(X13,Factors!$F$10:$G$50,2,FALSE))","v":""},{"$f":"IF(M13=\"\",\"\",Calculator!$D$37*U13)","v":""},"",{"$f":"IF(M13=\"\",\"\",Calculator!$D$42)","v":""},""]
["Maximum AP",6500,null,null,null,"Calculation date (today if blank)",{"$f":"IF(Calculator!D21=\"\",TODAY(),Calculator!D21)","v":"2019-12-11"},null,null,null,null,null,{"$f":"IF(S14<>\"\",YEAR(Codes!$K$17)+(N14-2)&\" / \"&YEAR(Codes!$K$17)+(N14-1),\"\")","v":""},"",null,"","","","","","","",{"$f":"IF(V14=\"\",\"\",VLOOKUP(V14,Factors!$A$10:$B$51,2,FALSE))","v":""},"",{"$f":"IF(X14=\"\",\"\",VLOOKUP(X14,Factors!$F$10:$G$50,2,FALSE))","v":""},{"$f":"IF(M14=\"\",\"\",Calculator!$D$37*U14)","v":""},"",{"$f":"IF(M14=\"\",\"\",Calculator!$D$42)","v":""},""]
["Earliest DOB (60 years ago tomorrow)",{"$f":"TODAY()-(60*365.25)+1","v":"1959-12-12"},null,null,null,"Next scheme year starts",{"$f":"IF(MONTH(G14)>3,DATE(YEAR(G14)+1,4,1),DATE(YEAR(G14),4,1))","v":"2020-04-01"},null,null,"Start date of periodic payments",{"$f":"IF(Calculator!D33=\"\",TODAY(),Calculator!D33)","v":"2019-12-11"},null,{"$f":"IF(S15<>\"\",YEAR(Codes!$K$17)+(N15-2)&\" / \"&YEAR(Codes!$K$17)+(N15-1),\"\")","v":""},"",null,"","","","","","","",{"$f":"IF(V15=\"\",\"\",VLOOKUP(V15,Factors!$A$10:$B$51,2,FALSE))","v":""},"",{"$f":"IF(X15=\"\",\"\",VLOOKUP(X15,Factors!$F$10:$G$50,2,FALSE))","v":""},{"$f":"IF(M15=\"\",\"\",Calculator!$D$37*U15)","v":""},"",{"$f":"IF(M15=\"\",\"\",Calculator!$D$42)","v":""},""]
["latest DOB (18 years ago today)",{"$f":"TODAY()-(18*365.25-1)","v":"2001-12-11T12:00:00"},null,null,null,"x = Age at calculation date",{"$f":"DATEDIF(Calculator!D15,Codes!G14,\"y\")","v":119},null,null,"31 March that yr",{"$f":"DATE(YEAR(K15),3,31)","v":"2019-03-31"},null,{"$f":"IF(S16<>\"\",YEAR(Codes!$K$17)+(N16-2)&\" / \"&YEAR(Codes!$K$17)+(N16-1),\"\")","v":""},"",null,"","","","","","","",{"$f":"IF(V16=\"\",\"\",VLOOKUP(V16,Factors!$A$10:$B$51,2,FALSE))","v":""},"",{"$f":"IF(X16=\"\",\"\",VLOOKUP(X16,Factors!$F$10:$G$50,2,FALSE))","v":""},{"$f":"IF(M16=\"\",\"\",Calculator!$D$37*U16)","v":""},"",{"$f":"IF(M16=\"\",\"\",Calculator!$D$42)","v":""},""]
[null,null,null,null,null,"y = Number of complete scheme year between calculation date and NPA",{"$f":"IF(OR(B6=\"\",G15=\"\"),\"\",DATEDIF(G15,B6,\"y\"))","v":""},null,null,"End of scheme year",{"$f":"IF(K16<K15,DATE(YEAR(K16)+1,3,31),DATE(YEAR(K16),3,31))","v":"2020-03-31"},null,{"$f":"IF(S17<>\"\",YEAR(Codes!$K$17)+(N17-2)&\" / \"&YEAR(Codes!$K$17)+(N17-1),\"\")","v":""},"",null,"","","","","","","",{"$f":"IF(V17=\"\",\"\",VLOOKUP(V17,Factors!$A$10:$B$51,2,FALSE))","v":""},"",{"$f":"IF(X17=\"\",\"\",VLOOKUP(X17,Factors!$F$10:$G$50,2,FALSE))","v":""},{"$f":"IF(M17=\"\",\"\",Calculator!$D$37*U17)","v":""},"",{"$f":"IF(M17=\"\",\"\",Calculator!$D$42)","v":""},""]
[null,null,null,null,null,null,null,null,null,null,null,null,{"$f":"IF(S18<>\"\",YEAR(Codes!$K$17)+(N18-2)&\" / \"&YEAR(Codes!$K$17)+(N18-1),\"\")","v":""},"",null,"","","","","","","",{"$f":"IF(V18=\"\",\"\",VLOOKUP(V18,Factors!$A$10:$B$51,2,FALSE))","v":""},"",{"$f":"IF(X18=\"\",\"\",VLOOKUP(X18,Factors!$F$10:$G$50,2,FALSE))","v":""},{"$f":"IF(M18=\"\",\"\",Calculator!$D$37*U18)","v":""},"",{"$f":"IF(M18=\"\",\"\",Calculator!$D$42)","v":""},""]
["Drop down lists",null,null,null,null,"How much additional pension will X by me?",null,null,null,"Contributions end date",{"$f":"IF(Calculator!D35=\"\",K17,Calculator!D35)","v":"2020-03-31"},null,{"$f":"IF(S19<>\"\",YEAR(Codes!$K$17)+(N19-2)&\" / \"&YEAR(Codes!$K$17)+(N19-1),\"\")","v":""},"",null,"","","","","","","",{"$f":"IF(V19=\"\",\"\",VLOOKUP(V19,Factors!$A$10:$B$51,2,FALSE))","v":""},"",{"$f":"IF(X19=\"\",\"\",VLOOKUP(X19,Factors!$F$10:$G$50,2,FALSE))","v":""},{"$f":"IF(M19=\"\",\"\",Calculator!$D$37*U19)","v":""},"",{"$f":"IF(M19=\"\",\"\",Calculator!$D$42)","v":""},""]
["Male",null,null,null,null,null,null,null,null,"31 March that yr",{"$f":"DATE(YEAR(K19),3,31)","v":"2020-03-31"},null,{"$f":"IF(S20<>\"\",YEAR(Codes!$K$17)+(N20-2)&\" / \"&YEAR(Codes!$K$17)+(N20-1),\"\")","v":""},"",null,"","","","","","","",{"$f":"IF(V20=\"\",\"\",VLOOKUP(V20,Factors!$A$10:$B$51,2,FALSE))","v":""},"",{"$f":"IF(X20=\"\",\"\",VLOOKUP(X20,Factors!$F$10:$G$50,2,FALSE))","v":""},{"$f":"IF(M20=\"\",\"\",Calculator!$D$37*U20)","v":""},"",{"$f":"IF(M20=\"\",\"\",Calculator!$D$42)","v":""},""]
{"$rows_left_out":36}
{"sheet":"Factors","index":2,"n_rows":51,"n_cols":8,"rows_kept":51,"cut":false,"hidden":true,"merged":[]}
["Government Actuary's Department",null,null,null,null,null,null,"2015-05-29"]
[]
["GAD Guidance : Firefighters' Pension Scheme (Scotland) 2015 - Purchase of Additional Pension"]
[]
["Table 1: Added Pension Lump Sum Factors",null,null,null,null,"Table 2: Added Pension Revaluation factor"]
["Males and Females",null,null,null,null,"Males and Females"]
[null,"2015 Scheme",null,null,null,null,"2015 Scheme"]
["Age last birthday on relevant date","Lump Sum factor",null,null,null,"Number of Complete Scheme Years before NRA","Revaluation Factor"]
["(1)","(2)",null,null,null,"(1)","(2)"]
[18,3.82,null,null,null,0,1]
[19,3.99,null,null,null,1,1.02]
[20,4.16,null,null,null,2,1.04]
[21,4.34,null,null,null,3,1.06]
[22,4.5199999999999996,null,null,null,4,1.08]
[23,4.71,null,null,null,5,1.1000000000000001]
[24,4.91,null,null,null,6,1.1299999999999999]
[25,5.1100000000000003,null,null,null,7,1.1499999999999999]
[26,5.33,null,null,null,8,1.17]
[27,5.55,null,null,null,9,1.2]
[28,5.79,null,null,null,10,1.22]
{"$rows_left_out":32}
{"sheet":"LumpSumPrint1","index":3,"n_rows":21,"n_cols":4,"rows_kept":21,"cut":false,"hidden":true,"merged":[[3,2,3,3]]}
[]
[]
[]
[null,null,"Illustration of added pension benefit cost"]
[null,null,{"$f":"Calculator!C3","v":"Member Details"}]
[null,null,{"$f":"Calculator!C15","v":"Date of Birth "},{"$f":"Calculator!D15","v":"00:00:00"}]
[null,null,"Retirement date (Normal Pension Age NPA=60) ",{"$f":"Codes!B3","v":"1959-12-31"}]
[null,null,{"$f":"Calculator!C21","v":"Calculation date (if blank, will use today's date) "},{"$f":"Codes!G14","v":"2019-12-11"}]
[]
[null,null,"Calculation"]
[null,null," Lump sum payment amount (LS) =",{"$f":"Codes!G21","v":0}]
[null,null,"Age at calculation date (X) =",{"$f":"Codes!G16","v":119}]
[null,null," Relevant factor F(x) =",{"$f":"Codes!G22","v":{"$error":"#N/A"}}]
[null,null," Number of complete scheme year between calculation date and NPA (y) = ",{"$f":"Codes!G17","v":""}]
[null,null," Relevant revaluation factor F(yReval) =",{"$f":"Codes!G23","v":{"$error":"#N/A"}}]
[]
[null,null,"Added pension purchased (P) =","LS/(Fx x FyReval)"]
[null,null," =",{"$f":"Codes!G26","v":{"$error":"#N/A"}}]
[null,null,"Results"]
[null,null,{"$f":"Calculator!C23","v":"Lump sum payment amount"},{"$f":"Calculator!D23","v":0}]
{"$rows_left_out":2}
{"sheet":"LumpSumPrint2","index":4,"n_rows":21,"n_cols":4,"rows_kept":21,"cut":false,"hidden":true,"merged":[[3,2,3,3]]}
[]
[]
[]
[null,null,"Illustration of added pension benefit cost"]
[null,null,{"$f":"Calculator!C3","v":"Member Details"}]
[null,null,{"$f":"Calculator!C15","v":"Date of Birth "},{"$f":"Calculator!D15","v":"00:00:00"}]
[null,null,"NPA ",{"$f":"Codes!B3","v":"1959-12-31"}]
[null,null,{"$f":"Calculator!C21","v":"Calculation date (if blank, will use today's date) "},{"$f":"Codes!G14","v":"2019-12-11"}]
[]
[null,null,"Calculation:"]
[null,null,"Amount of added pension to be purchased (P) =",{"$f":"Codes!G31","v":0}]
[null,null,"Age at calculation date (X) =",{"$f":"Codes!G16","v":119}]
[null,null," Relevant factor F(x) =",{"$f":"Codes!G32","v":{"$error":"#N/A"}}]
[null,null," Number of complete scheme year between calculation date and NPA (y) = ",{"$f":"Codes!G17","v":""}]
[null,null," Relevant revaluation factor F(yReval) =",{"$f":"Codes!G33","v":{"$error":"#N/A"}}]
[]
[null,null,{"$f":"Codes!F35","v":"LS ="},"P x Fx x FyReval"]
[null,null,{"$f":"Codes!F36","v":"="},{"$f":"Codes!G36","v":{"$error":"#N/A"}}]
[null,null,"Results"]
[null,null,{"$f":"Calculator!C27","v":"If I want to buy this much added pension "},{"$f":"Calculator!D27","v":0}]
{"$rows_left_out":2}
{"sheet":"RegularContsPrint1","index":5,"n_rows":76,"n_cols":6,"rows_kept":76,"cut":false,"hidden":true,"merged":[[12,2,12,3],[13,2,13,3],[14,2,14,3],[3,2,3,4],[5,2,5,3],[6,2,6,3],[7,2,7,3],[8,2,8,3],[11,2,11,3],[75,2,75,5],[15,2,15,3],[16,2,16,3],[17,2,17,3],[18,2,18,3],[17,4,17,5],[22,2,22,3]]}
[]
[]
[]
[null,null,"Illustration of added pension benefit cost"]
[null,null,{"$f":"Calculator!C3","v":"Member Details"}]
[null,null,{"$f":"Calculator!C15","v":"Date of Birth "},null,{"$f":"Calculator!D15","v":"00:00:00"}]
[null,null,"NPA",null,{"$f":"Codes!B3","v":"1959-12-31"}]
[null,null,{"$f":"Calculator!C33","v":"Start date of periodic payments (if blank, will use today's date)"},null,{"$f":"Codes!K15","v":"2019-12-11"}]
[null,null,{"$f":"Calculator!C35","v":"End date of periodic contributions (if blank, will quote to end of scheme year 31 March 2020)"},null,{"$f":"Codes!K19","v":"2020-03-31"}]
[]
[null,null,"First year calculation"]
[null,null,"Monthly Contributions =",null,{"$f":"Calculator!D37","v":0}]
[null,null,"Total contributions for first year (C) =",null,{"$f":"Codes!Z8","v":""}]
[null,null,"Age at contribution end of start date scheme year (X) =",null,{"$f":"Codes!V8","v":0}]
[null,null," Relevant factor (Fx) =",null,{"$f":"Codes!W8","v":{"$error":"#N/A"}}]
[null,null,"Number of subsequent scheme years up to NPA (y) =",null,{"$f":"Codes!X8","v":{"$error":"#NUM!"}}]
[null,null," Relevant revaluation factor (Fy Reval) =",null,{"$f":"Codes!Y8","v":{"$error":"#NUM!"}}]
[null,null,"Amount of added pension purchased (P) =",null,"(1.025 x C)/(Fx x FyReval)"]
[null,null,"=",null,{"$f":"Codes!AA8","v":""}]
[]
{"$rows_left_out":57}
{"sheet":"RegularContsPrint2","index":6,"n_rows":67,"n_cols":6,"rows_kept":67,"cut":false,"hidden":true,"merged":[[3,2,3,4],[18,4,18,5],[11,2,11,3],[12,2,12,3],[13,2,13,3],[14,2,14,3],[15,2,15,3],[16,2,16,3],[17,2,17,3],[18,2,18,3],[66,2,66,5],[61,2,61,4],[19,2,19,3],[21,2,21,3],[5,2,5,3],[6,2,6,3],[7,2,7,3],[8,2,8,3],[62,2,62,5]]}
[]
[]
[]
[null,null,"Illustration of added pension benefit cost"]
[null,null,{"$f":"Calculator!C3","v":"Member Details"}]
[null,null,{"$f":"Calculator!C15","v":"Date of Birth "},null,{"$f":"Calculator!D15","v":"00:00:00"}]
[null,null,"NPA",null,{"$f":"Codes!B3","v":"1959-12-31"}]
[null,null,{"$f":"Calculator!C33","v":"Start date of periodic payments (if blank, will use today's date)"},null,{"$f":"Codes!K15","v":"2019-12-11"}]
[null,null,{"$f":"Calculator!C35","v":"End date of periodic contributions (if blank, will quote to end of scheme year 31 March 2020)"},null,{"$f":"Codes!K19","v":"2020-03-31"}]
[]
[null,null,"Calculation for the first scheme year of contributions"]
[null,null,"Amount of added pension to be purchased (P) =",null,{"$f":"Codes!AB8","v":""}]
[null,null,"Number of payments within the first scheme year =",null,{"$f":"Codes!U8","v":""}]
[null,null,"Age at calculation date (X) =",null,{"$f":"Codes!V8","v":0}]
[null,null," Relevant factor (Fx) =",null,{"$f":"Codes!W8","v":{"$error":"#N/A"}}]
[null,null,"Number of subsequent scheme years up to NPA (y) =",null,{"$f":"Codes!X8","v":{"$error":"#NUM!"}}]
[null,null," Relevant revaluation factor (FyReval) =",null,{"$f":"Codes!Y8","v":{"$error":"#NUM!"}}]
[]
[null,null,"Monthly Payments =",null,"(P x Fx x FyReval)/(number of monthly conts x 1.025)"]
[null,null,"=",null,{"$f":"Codes!AC8","v":""}]
{"$rows_left_out":48}
{"sheet":"Application","index":7,"n_rows":56,"n_cols":13,"rows_kept":56,"cut":false,"hidden":true,"merged":[[11,6,11,14],[13,6,13,14],[15,6,15,14],[46,6,46,14],[47,6,47,14],[26,5,26,6],[24,1,24,15],[27,5,27,6],[14,1,14,2],[16,1,16,2],[17,6,17,14],[18,1,18,2],[28,5,28,6],[30,1,30,15],[32,1,32,15],[37,1,37,15],[48,6,48,14],[38,1,38,15],[49,6,49,14],[43,4,43,5],[59,3,59,10],[46,1,46,4],[48,1,48,4],[55,2,55,4],[50,7,50,14],[6,1,6,4],[8,1,8,4],[10,1,10,4],[1,1,1,15],[4,3,4,7],[4,1,4,2],[6,6,6,14],[7,6,7,14],[8,6,8,14],[9,7,9,14]]}
[]
[null,"APPLICATION FORM FOR ADDED PENSION"]
[]
[null,"SECTION 1 - PERSONAL DETAILS"]
[null,"National Insurance No",null,{"$f":"IF(Calculator!D14=\"\",\"\",Calculator!D14)","v":""}]
[null,"Surname",null,null,null,null,"Contact Address"]
[null,{"$f":"IF(Calculator!D4=\"\",\"\",Calculator!D4)","v":""},null,null,null,null,{"$f":"IF(Calculator!D7=\"\",\"\",Calculator!D7)","v":""}]
[null,"Former surname (if applicable)",null,null,null,null,{"$f":"IF(Calculator!D8=\"\",\"\",Calculator!D8)","v":""}]
[null,{"$f":"IF(Calculator!D5=\"\",\"N/A\",Calculator!D5)","v":"N/A"},null,null,null,null,{"$f":"IF(Calculator!D9=\"\",\"\",Calculator!D9)","v":""}]
[null,"Forenames (in full)",null,null,null,null,"Postcode",{"$f":"IF(Calculator!D10=\"\",\"\",Calculator!D10)","v":""}]
[null,{"$f":"IF(Calculator!D6=\"\",\"\",Calculator!D6)","v":""},null,null,null,null,"Home telephone number (including STD code)"]
[null,"Title",null,null,null,null,{"$f":"IF(Calculator!D11=\"\",\"\",Calculator!D11)","v":""}]
[null,{"$f":"IF(Calculator!G4=\"\",\"\",Calculator!G4)","v":""},null,null,null,null,"Mobile telephone number"]
[null,"If other, please specify",null,null,null,null,{"$f":"IF(Calculator!D12=\"\",\"\",Calculator!D12)","v":""}]
[null,{"$f":"IF(Calculator!G4<>\"Other\",\"N/A\",IF(Calculator!H6=\"\",\"\",Calculator!H6))","v":"N/A"},null,null,null,null,"Email address"]
[null,"Date of birth",null,null,null,null,{"$f":"IF(Calculator!D13=\"\",\"\",Calculator!D13)","v":""}]
[null,{"$f":"IF(Calculator!D15=\"\",\"\",Calculator!D15)","v":""},null,null,null,null,"Current employer"]
[null,"Gender",null,null,null,null,{"$f":"IF(Calculator!D17=\"\",\"\",Calculator!D17)","v":""}]
[null,{"$f":"IF(Calculator!D16=\"\",\"\",Calculator!D16)","v":""}]
[]
{"$rows_left_out":37}
{"sheet":"GuidanceNotes","index":8,"n_rows":43,"n_cols":6,"rows_kept":43,"cut":false,"hidden":true,"merged":[]}
[]
[null,"Added Pension (AP) guidance notes"]
[null,"Disclaimer:\nThis calculation is intended for illustration purposes only. This is not a statement of you legal entitlement. While every care has been taken in the preparation of this calculator the Scottish Public Pension Agency will accept no responsibility for the accuracy of the information it provides.\n\nPlease refer to pages on the SPPA website for points of contact and other benefits available."]
[null,"Using the calculator\nYou must be a contributing member of the Firefighters’ Pension Scheme (Scotland) 2015.\n\nAP benefits will be paid with your scheme retirement benefits and will be index linked.\n\nThe cost of purchasing AP depends on your age, your Normal Pension Age (NPA) and the amount of AP you wish to receive.\n\nCurrently the maximum AP allowed is £6500, however this is subject to change and will be reviewed annually. "]
[null,"There are two ways you can pay for AP. You can pay by having regular deductions taken from your monthly salary or by paying a one off lump sum. Your added pension balance will be revalued annually to maintain its purchasing power. If you retire before Normal Pension Age then your added pension purchase (as well as your pension) will be subject to early retirement factors. The added pension includes a 50% survivors benefit in the event of your death."]
[null,"Paying by Lump Sum\nIf paying by lump sum, you have the following options:\n     • buy an amount of added pension and we will determine the lump sum cost required\n     • pay a specific lump sum and we will determine how much added pension that will buy\n\nAn election to pay added pension by a lump sum payment may only be made if the member gives notice to the scheme manager not later than 12 months after the date on which the person last became employed by the authority as a firefighter."]
[null,"Paying by Regular Contributions\nIf paying by regular contributions, you have the following options:\n     • pay a specific amount of contributions from the election date to the end of the scheme year and we will determine how \n       much added pension that will buy \n     • buy a specific amount of AP and we will determine the contribution required from the election date to the end of the\n       scheme year\n\nAn election to pay added pension payments by periodical payments may only be made at least two years before  normal pension age and cannot be made once the scheme manager has agreed that the member will leave the scheme with entitlement to a pension or an ill health pension.\n\nThis calculator can provide an estimate, at today's prices, up to your normal pension date. However please note that amounts will be calculated each year and the factors may change in the future affecting the accuracy of the estimate. "]
[null,"Limitations\nThis calculator can provide an estimate, at todays prices, up to your retirement date. However please note that amounts will be calculated each year and the factors may change in the future affecting the accuracy of the estimate. "]
[]
[]
[]
[]
[]
[]
[]
[]
[]
[]
[]
[]
{"$rows_left_out":23}